program: Gaussian 16
title: Title Card Required
version: ES64L-G16RevC.02
basis: 6-31+G(d,p)
method: UwB97XD TD-FC
operation: Force
keyword: #p
keyword: td=(nstates=40,root=3)
keyword: uwb97xd/6-31+g(d,p)
keyword: force
keyword: scrf=(CPCM,solvent=chloroform)
keyword: nosymm
keyword: scf=xqc
keyword: Guess=mix
keyword: density=current
title: #p td=(nstates=40,root=3) uwb97xd/6-31+g(d,p) force scrf=(CPCM,solvent
basis: NPDir=0 NMtPBC= 1 NCelOv= 1 NCel= 1 NClECP= 1 NCelD= 1
basis: NCelK= 1 NCelE2= 1 NClLst= 1 CellRange= 0.0.
basis: One-electron integrals computed using PRISM.
basis: NBasis= 859 RedAO= T EigKep= 1.12D-06 NBF= 859
basis: NBsUse= 854 1.00D-06 EigRej= 7.48D-07 NBFU= 854
converged: NO NO NO NO
hfenergy: -1479.2173088 hartree
pointgroup: C01 [X(C32H35N3O1)]
dipole: -2.618317 -0.6347836 -3.9380101 debye
InChI: InChI=1/32C.3N.O.35H
charge 2 multiplicity 1
71 atoms
C  0.6145933 -2.25676539 -0.52053096
C  -0.55793923 -1.98739682 -1.29415123
C  -0.76863941 -0.66632357 -1.79286377
C  0.18501831 0.30343542 -1.5643587
C  1.32937624 -0.00897443 -0.82509555
C  1.56309643 -1.29811406 -0.28926412
C  -0.5697483 -4.15419694 -0.65479484
C  -1.31234541 -3.18654958 -1.38667104
H  -1.6686467 -0.39508135 -2.33141442
H  0.03677271 1.30728999 -1.93994118
H  2.06943167 0.76163025 -0.63697699
H  2.45738806 -1.50521244 0.2795567
N  0.55785118 -3.60665823 -0.1112879
H  -0.82536697 -5.19311322 -0.51447582
C  1.45378781 -4.20900522 0.79229588
O  2.42721326 -3.58618109 1.17446153
C  1.11722156 -5.58807471 1.29914967
H  0.71572402 -6.23696008 0.51638688
H  2.06424729 -6.01751419 1.6291982
C  0.14995027 -5.51523994 2.51021304
H  0.5385836 -4.7867233 3.22887631
H  0.17745761 -6.49645053 2.99455651
C  -1.2694767 -5.18748926 2.14640268
H  -1.82308687 -5.96666859 1.62244331
C  -1.88213672 -4.03305939 2.42844819
H  -1.36714309 -3.23462799 2.95794205
H  -2.91627975 -3.85855262 2.1481147
C  -2.57276565 -3.42484469 -2.00657535
H  -3.09121615 -4.35611956 -1.80422256
N  -3.12738239 -2.63374991 -2.95405237
H  -2.6898444 -1.75646936 -3.19698453
C  -3.02455123 -0.11296077 -5.00720471
C  -4.27449367 -0.54251688 -4.54872852
C  -5.1118282 0.36956099 -3.89658672
C  -4.69835587 1.68246622 -3.69768312
C  -3.4413129 2.09751776 -4.13600586
C  -2.60487062 1.19906889 -4.79328044
H  -2.37502754 -0.80408408 -5.53845618
H  -6.08857003 0.06929694 -3.53031317
H  -5.3583557 2.38016822 -3.19372373
H  -3.12108036 3.1212228 -3.97417131
H  -1.63156424 1.5169539 -5.15125313
C  -4.63643584 -2.00197927 -4.72155751
H  -3.95433723 -2.44874463 -5.44993413
C  -4.49517972 -2.81767545 -3.39635891
H  -4.61273449 -3.87946576 -3.6429239
C  -5.53105733 -2.47630021 -2.3303241
C  -6.73905343 -3.17917286 -2.30063903
C  -5.30460635 -1.47486947 -1.3822296
C  -7.72516332 -2.85706412 -1.36892635
H  -6.90653266 -4.00763648 -2.98407386
C  -6.28396429 -1.15874385 -0.44622577
H  -4.36362107 -0.93494403 -1.37376864
C  -7.50015044 -1.84168076 -0.44328065
H  -8.6570463 -3.41224829 -1.35745444
H  -6.09701988 -0.37777179 0.28334296
H  -8.26177132 -1.59361808 0.28836835
C  -6.29031442 -1.25378584 -6.48637828
C  -6.28375283 -3.6071533 -5.81606599
C  -7.22918014 -2.0480573 -7.37495516
H  -5.33439439 -1.06843704 -6.97978133
H  -6.68596853 -0.31437466 -6.10605818
C  -6.64642351 -3.45781194 -7.29118527
H  -7.11399818 -4.0009418 -5.23113941
H  -5.40077445 -4.22011829 -5.64350952
H  -8.25167214 -2.01833479 -6.98680124
H  -7.23631486 -1.64704815 -8.38911574
H  -7.34769659 -4.234312 -7.59821247
H  -5.75170742 -3.53850235 -7.91441403
N  -6.008845 -2.18538402 -5.31451356
H  -6.69503909 -1.98304667 -4.5802417
