program: Gaussian 16
title: Title Card Required
version: ES64L-G16RevC.02
basis: 6-31+G(d,p)
method: UwB97XD TD-FC
operation: Force
keyword: #p
keyword: td=(nstates=40,root=3)
keyword: uwb97xd/6-31+g(d,p)
keyword: force
keyword: scrf=(CPCM,solvent=chloroform)
keyword: nosymm
keyword: scf=xqc
keyword: Guess=mix
keyword: density=current
title: #p td=(nstates=40,root=3) uwb97xd/6-31+g(d,p) force scrf=(CPCM,solvent
basis: NPDir=0 NMtPBC= 1 NCelOv= 1 NCel= 1 NClECP= 1 NCelD= 1
basis: NCelK= 1 NCelE2= 1 NClLst= 1 CellRange= 0.0.
basis: One-electron integrals computed using PRISM.
basis: NBasis= 859 RedAO= T EigKep= 1.12D-06 NBF= 859
basis: NBsUse= 854 1.00D-06 EigRej= 7.37D-07 NBFU= 854
converged: NO NO NO NO
hfenergy: -1479.2167425 hartree
pointgroup: C01[X(C32H35N3O1)]
dipole: -2.2123448 -0.3099541 -3.7837242 debye
InChI: InChI=1/32C.3N.O.35H
charge 2 multiplicity 1
71 atoms
C  0.61014741 -2.25645921 -0.52497375
C  -0.55330472 -1.9846893 -1.2937158
C  -0.76478644 -0.66863044 -1.7916817
C  0.18343305 0.30207163 -1.56487941
C  1.32869457 -0.0172579 -0.82281287
C  1.56170539 -1.29138425 -0.29276009
C  -0.57182793 -4.15367447 -0.65168743
C  -1.30996709 -3.18695642 -1.38344443
H  -1.66930159 -0.39376947 -2.33359629
H  0.03541126 1.30856196 -1.94083125
H  2.07191734 0.76291431 -0.63573297
H  2.46060495 -1.50453199 0.28138252
N  0.55797619 -3.61241182 -0.10942871
H  -0.82690469 -5.1921351 -0.51209531
C  1.44794514 -4.21232547 0.79006311
O  2.4320108 -3.58237132 1.17760663
C  1.11754159 -5.58723429 1.29904994
H  0.71594698 -6.23723138 0.51646102
H  2.06503259 -6.01770006 1.62919612
C  0.15027924 -5.51523863 2.5097286
H  0.53872264 -4.7864909 3.22846733
H  0.17758939 -6.49624571 2.99445698
C  -1.26912235 -5.18642902 2.14638286
H  -1.82301309 -5.96664113 1.62162382
C  -1.88167277 -4.03399818 2.42832427
H  -1.36680509 -3.23473591 2.9583318
H  -2.91603833 -3.85856929 2.14825067
C  -2.57686893 -3.4313839 -2.00939352
H  -3.087793 -4.35382627 -1.80829384
N  -3.12466154 -2.62761789 -2.95631957
H  -2.69445136 -1.75580214 -3.19457664
C  -3.02469971 -0.11337071 -5.00703601
C  -4.27436512 -0.54291684 -4.54888424
C  -5.11193393 0.36957105 -3.89627149
C  -4.69865207 1.68206473 -3.69747793
C  -3.44105595 2.09740673 -4.13607841
C  -2.60501216 1.19928573 -4.79294207
H  -2.37516482 -0.80420235 -5.53814715
H  -6.08837828 0.06883491 -3.52984607
H  -5.35838157 2.38002475 -3.19367602
H  -3.12121755 3.12116474 -3.97423332
H  -1.63169258 1.51688681 -5.15132946
C  -4.63621574 -2.00163318 -4.72165616
H  -3.9542217 -2.44893279 -5.45036977
C  -4.49666791 -2.81812463 -3.39572233
H  -4.61265009 -3.87950073 -3.64202279
C  -5.53081988 -2.47582232 -2.33130526
C  -6.7393273 -3.17904013 -2.3008539
C  -5.30495359 -1.47433841 -1.38269344
C  -7.72544784 -2.85720114 -1.36872261
H  -6.90670859 -4.00755953 -2.98425632
C  -6.28429312 -1.15846836 -0.44645426
H  -4.36365382 -0.93544023 -1.37419762
C  -7.50018448 -1.84151513 -0.4431582
H  -8.65695983 -3.41231746 -1.35723759
H  -6.09705505 -0.37764794 0.28344299
H  -8.26175448 -1.59368656 0.28844478
C  -6.29029399 -1.25351738 -6.48649854
C  -6.28390844 -3.60710136 -5.81617207
C  -7.22916074 -2.04809787 -7.37486218
H  -5.33439104 -1.06861151 -6.97961014
H  -6.68574655 -0.31442435 -6.10610897
C  -6.64643917 -3.45778724 -7.29112595
H  -7.11399613 -4.00098352 -5.23108031
H  -5.40073628 -4.22004383 -5.64347812
H  -8.2516546 -2.01834667 -6.98683213
H  -7.23629935 -1.64695313 -8.38909141
H  -7.34777845 -4.23427113 -7.59817856
H  -5.75174701 -3.53857137 -7.91441938
N  -6.00889982 -2.18581914 -5.31428
H  -6.69499094 -1.98308852 -4.58005969
