program: Gaussian 16
title: Title Card Required
version: ES64L-G16RevC.02
basis: 6-31+G(d,p)
method: UwB97XD TD-FC
operation: Force
keyword: #p
keyword: td=(nstates=40,root=2)
keyword: uwb97xd/6-31+g(d,p)
keyword: force
keyword: scrf=(CPCM,solvent=chloroform)
keyword: nosymm
keyword: scf=xqc
keyword: Guess=mix
keyword: density=current
title: #p td=(nstates=40,root=2) uwb97xd/6-31+g(d,p) force scrf=(CPCM,solvent
basis: NPDir=0 NMtPBC= 1 NCelOv= 1 NCel= 1 NClECP= 1 NCelD= 1
basis: NCelK= 1 NCelE2= 1 NClLst= 1 CellRange= 0.0.
basis: One-electron integrals computed using PRISM.
basis: NBasis= 859 RedAO= T EigKep= 1.05D-06 NBF= 859
basis: NBsUse= 854 1.00D-06 EigRej= 7.30D-07 NBFU= 854
converged: NO NO NO NO
hfenergy: -1479.2115182 hartree
pointgroup: C01 [X(C32H35N3O1)]
dipole: -1.7446514 -0.1906606 -3.7348841 debye
InChI: InChI=1/32C.3N.O.35H
charge 2 multiplicity 1
71 atoms
C  0.59429739 -2.25937829 -0.53671128
C  -0.60652074 -1.98381411 -1.26428127
C  -0.87233846 -0.67258831 -1.70619979
C  0.0833335 0.31233205 -1.47537114
C  1.27147394 0.00955631 -0.7937157
C  1.54913001 -1.27849364 -0.31043525
C  -0.58641759 -4.17031284 -0.68040821
C  -1.35743149 -3.2016032 -1.34117869
H  -1.80133589 -0.42748343 -2.20912896
H  -0.09293767 1.32599031 -1.81523143
H  1.99834879 0.79496922 -0.62151892
H  2.46814336 -1.49478885 0.21407825
N  0.55629693 -3.5985051 -0.15269204
H  -0.80470877 -5.21747915 -0.56001373
C  1.47815109 -4.22564084 0.73016762
O  2.48103972 -3.62659454 1.05379166
C  1.11157821 -5.58349662 1.26941665
H  0.6997353 -6.23725339 0.4962268
H  2.05132994 -6.02327832 1.60576689
C  0.14293241 -5.47905897 2.47816008
H  0.53436472 -4.74110179 3.18575952
H  0.16818096 -6.4525905 2.9782255
C  -1.27750542 -5.15446497 2.11137155
H  -1.8273458 -5.93606228 1.58668202
C  -1.89520777 -4.0039957 2.39261956
H  -1.3868845 -3.20278116 2.92416165
H  -2.92875194 -3.83327514 2.1067178
C  -2.67261553 -3.37516144 -1.84633064
H  -3.33766042 -4.11279007 -1.4104172
N  -3.12112181 -2.69396417 -2.92905471
H  -2.44342576 -2.26079986 -3.54116477
C  -3.00549938 -0.10843608 -5.00486845
C  -4.24919977 -0.54181322 -4.53590225
C  -5.08792281 0.37141352 -3.88837941
C  -4.67883635 1.68713405 -3.69814327
C  -3.42484324 2.10457494 -4.1427408
C  -2.58894979 1.20569257 -4.79990799
H  -2.35711469 -0.79402273 -5.54523351
H  -6.06517992 0.07202171 -3.52218681
H  -5.34152168 2.38650536 -3.19959612
H  -3.10793233 3.13068115 -3.98853622
H  -1.6199122 1.52574065 -5.16729326
C  -4.61119425 -2.00025435 -4.71474017
H  -3.93319809 -2.43952281 -5.45312998
C  -4.48338756 -2.84202448 -3.4051659
H  -4.64103072 -3.89414803 -3.67879802
C  -5.50484924 -2.49382648 -2.33434475
C  -6.71635835 -3.18987009 -2.29894054
C  -5.26855025 -1.49078672 -1.38996613
C  -7.69971876 -2.85730765 -1.36857941
H  -6.88676894 -4.02107045 -2.97849412
C  -6.24332285 -1.16797153 -0.45208682
H  -4.32246459 -0.95933577 -1.39104196
C  -7.46496927 -1.84160559 -0.44573739
H  -8.6358869 -3.40471322 -1.356282
H  -6.04960789 -0.38701054 0.27556813
H  -8.22314224 -1.58665953 0.28685054
C  -6.27484861 -1.24718203 -6.47527871
C  -6.25998947 -3.60446786 -5.8186809
C  -7.21573062 -2.03964201 -7.36430115
H  -5.32253737 -1.05403983 -6.97238964
H  -6.6732439 -0.31220566 -6.08712349
C  -6.6294717 -3.44813793 -7.29075314
H  -7.08691907 -4.00171974 -5.23116223
H  -5.37666523 -4.21893422 -5.6550305
H  -8.23691812 -2.01489632 -6.97220517
H  -7.22802448 -1.63347278 -8.37636046
H  -7.32963613 -4.22542689 -7.59846801
H  -5.73699057 -3.5233258 -7.91802464
N  -5.9842925 -2.18464377 -5.31035115
H  -6.66856694 -1.98767103 -4.57286561
