program: Gaussian 16
title: Title Card Required
version: ES64L-G16RevC.02
basis: 6-31+G(d,p)
method: UwB97XD TD-FC
operation: Force
keyword: #p
keyword: td=(nstates=40,root=3)
keyword: uwb97xd/6-31+g(d,p)
keyword: force
keyword: scrf=(CPCM,solvent=chloroform)
keyword: nosymm
keyword: scf=xqc
keyword: Guess=mix
keyword: density=current
title: #p td=(nstates=40,root=3) uwb97xd/6-31+g(d,p) force scrf=(CPCM,solvent
basis: NPDir=0 NMtPBC= 1 NCelOv= 1 NCel= 1 NClECP= 1 NCelD= 1
basis: NCelK= 1 NCelE2= 1 NClLst= 1 CellRange= 0.0.
basis: One-electron integrals computed using PRISM.
basis: NBasis= 859 RedAO= T EigKep= 1.05D-06 NBF= 859
basis: NBsUse= 854 1.00D-06 EigRej= 7.32D-07 NBFU= 854
converged: NO NO NO NO
hfenergy: -1479.211591 hartree
pointgroup: C01 [X(C32H35N3O1)]
dipole: -1.7450798 -0.1876701 -3.7401925 debye
InChI: InChI=1/32C.3N.O.35H
charge 2 multiplicity 1
71 atoms
C  0.59500498 -2.25890861 -0.53676623
C  -0.60575516 -1.98310765 -1.26398854
C  -0.87048054 -0.67197656 -1.70658269
C  0.08606368 0.31251915 -1.47647055
C  1.27376119 0.00957534 -0.79429005
C  1.55020055 -1.27842349 -0.31035689
C  -0.58482939 -4.17006295 -0.68180347
C  -1.35675877 -3.20072844 -1.34188044
H  -1.79964321 -0.42662966 -2.20890144
H  -0.09025316 1.3262094 -1.81604273
H  2.00161684 0.79433361 -0.62226112
H  2.4684013 -1.49497069 0.21534744
N  0.55733995 -3.59841927 -0.15352613
H  -0.80324226 -5.21698975 -0.56133495
C  1.47713857 -4.22495651 0.73125168
O  2.47801847 -3.62492004 1.05891208
C  1.11092345 -5.58364978 1.26878498
H  0.69944259 -6.23735053 0.4952373
H  2.05053932 -6.0237103 1.60477164
C  0.14237146 -5.47984855 2.47786619
H  0.53369854 -4.74192301 3.1852172
H  0.16833508 -6.45307583 2.9782542
C  -1.27809318 -5.15540467 2.11147863
H  -1.82800933 -5.93703769 1.58663355
C  -1.89561529 -4.00481552 2.39286004
H  -1.38716975 -3.2035989 2.92455165
H  -2.9289288 -3.83381598 2.10675913
C  -2.67153863 -3.37458442 -1.84772772
H  -3.33672237 -4.11291784 -1.41229572
N  -3.12111652 -2.69185284 -2.92869646
H  -2.44406761 -2.25631322 -3.53966739
C  -3.00608862 -0.10849478 -5.00450077
C  -4.24980769 -0.54204589 -4.53596393
C  -5.08876439 0.37142041 -3.88846361
C  -4.67936783 1.68733066 -3.69843108
C  -3.42518903 2.10449687 -4.14298261
C  -2.58932328 1.20521324 -4.79950573
H  -2.35776808 -0.79431052 -5.54524855
H  -6.06604537 0.07256288 -3.52239034
H  -5.34186656 2.38665706 -3.19998567
H  -3.1085168 3.13060051 -3.98918089
H  -1.61982204 1.52512619 -5.16628293
C  -4.61186445 -2.00007764 -4.71468905
H  -3.93387032 -2.43991133 -5.45321314
C  -4.4832073 -2.84166544 -3.40480382
H  -4.63959568 -3.89423853 -3.67788831
C  -5.504964 -2.49380663 -2.33408691
C  -6.71610945 -3.19007102 -2.29920118
C  -5.26844389 -1.49073664 -1.38976969
C  -7.69964911 -2.85739287 -1.36884987
H  -6.88675686 -4.02098263 -2.9790146
C  -6.24411054 -1.16814088 -0.45188671
H  -4.32281259 -0.95913035 -1.38995096
C  -7.46536296 -1.84213743 -0.44594174
H  -8.63641111 -3.40445828 -1.35753487
H  -6.05070316 -0.3869211 0.27557896
H  -8.22354798 -1.58725264 0.28631403
C  -6.2754292 -1.24753113 -6.47508407
C  -6.26068136 -3.60458213 -5.81809101
C  -7.21609192 -2.04016813 -7.36428141
H  -5.32295213 -1.05465161 -6.97220927
H  -6.67374006 -0.31247065 -6.0873703
C  -6.62971058 -3.44863497 -7.290312
H  -7.08766071 -4.00178876 -5.23074916
H  -5.37719043 -4.21903166 -5.65396317
H  -8.23736211 -2.01531553 -6.97260691
H  -7.22783393 -1.63420375 -8.37637494
H  -7.32978454 -4.225959 -7.59813786
H  -5.73711375 -3.52377374 -7.91734167
N  -5.98507061 -2.18483616 -5.30990098
H  -6.66911169 -1.98762077 -4.57241608
