program: Gaussian 16
title: Title Card Required
version: ES64L-G16RevC.02
basis: 6-31+G(d,p)
method: UwB97XD TD-FC
operation: Force
keyword: #p
keyword: td=(nstates=40,root=3)
keyword: uwb97xd/6-31+g(d,p)
keyword: force
keyword: scrf=(CPCM,solvent=chloroform)
keyword: nosymm
keyword: scf=xqc
keyword: Guess=mix
keyword: density=current
title: #p td=(nstates=40,root=3) uwb97xd/6-31+g(d,p) force scrf=(CPCM,solvent
basis: NPDir=0 NMtPBC= 1 NCelOv= 1 NCel= 1 NClECP= 1 NCelD= 1
basis: NCelK= 1 NCelE2= 1 NClLst= 1 CellRange= 0.0.
basis: One-electron integrals computed using PRISM.
basis: NBasis= 859 RedAO= T EigKep= 1.05D-06 NBF= 859
basis: NBsUse= 854 1.00D-06 EigRej= 7.32D-07 NBFU= 854
converged: NO NO NO NO
hfenergy: -1479.2114657 hartree
pointgroup: C01[X(C32H35N3O1)]
dipole: -1.7382567 -0.1864223 -3.7417898 debye
InChI: InChI=1/32C.3N.O.35H
charge 2 multiplicity 1
71 atoms
C  0.59469171 -2.25825641 -0.53772224
C  -0.60706486 -1.98268201 -1.26309602
C  -0.87042696 -0.67187632 -1.70618506
C  0.08601763 0.31295171 -1.47576391
C  1.27422418 0.01018147 -0.79350566
C  1.55072887 -1.27841657 -0.3113695
C  -0.5846505 -4.16987728 -0.68249008
C  -1.35799163 -3.2005653 -1.34016858
H  -1.80002346 -0.42684517 -2.20820327
H  -0.09081388 1.32679433 -1.81373207
H  2.00233616 0.79486225 -0.62109337
H  2.46876287 -1.49558321 0.21386336
N  0.55776068 -3.59813337 -0.15509822
H  -0.80260318 -5.21651043 -0.56046188
C  1.4768705 -4.22435189 0.73052253
O  2.47771106 -3.62467947 1.05933834
C  1.11013397 -5.58333949 1.26787424
H  0.69934851 -6.23743769 0.4945483
H  2.04966328 -6.02376318 1.60353886
C  0.14207354 -5.47994633 2.47676695
H  0.53299864 -4.74209987 3.18441928
H  0.16877113 -6.45245549 2.97818604
C  -1.27872274 -5.15544385 2.11112546
H  -1.82825105 -5.93713337 1.58587444
C  -1.89598982 -4.00469068 2.3927725
H  -1.38787328 -3.20381291 2.92492838
H  -2.92861314 -3.83326691 2.10507786
C  -2.6729311 -3.37491968 -1.84627828
H  -3.33936078 -4.11067933 -1.40849541
N  -3.12134425 -2.69132576 -2.92774325
H  -2.44112847 -2.26218001 -3.54188152
C  -3.00599294 -0.10861539 -5.0043434
C  -4.249688 -0.54206959 -4.53564103
C  -5.08879631 0.37167631 -3.88850508
C  -4.67909904 1.68734004 -3.69863094
C  -3.42528953 2.10462501 -4.14297752
C  -2.58901612 1.20537781 -4.79956545
H  -2.35787041 -0.79388465 -5.54563493
H  -6.06651296 0.07329801 -3.52292341
H  -5.3415627 2.38676052 -3.19981668
H  -3.10865663 3.13084779 -3.98975022
H  -1.61978482 1.52520521 -5.16617749
C  -4.61157782 -2.00044237 -4.71473445
H  -3.93380863 -2.4402475 -5.45294886
C  -4.48283266 -2.84187948 -3.40510331
H  -4.63925702 -3.8949706 -3.67779096
C  -5.50426353 -2.49427661 -2.33403947
C  -6.71544527 -3.19067692 -2.29931138
C  -5.26808449 -1.49056165 -1.38949206
C  -7.69928958 -2.8579384 -1.36911326
H  -6.88640208 -4.02115443 -2.97906965
C  -6.24310416 -1.16810415 -0.45219566
H  -4.32226492 -0.95915755 -1.38921679
C  -7.46468137 -1.84273327 -0.4459592
H  -8.63645523 -3.40364854 -1.35862808
H  -6.05072854 -0.38651504 0.27520612
H  -8.22293639 -1.58764576 0.28630769
C  -6.27562818 -1.24779427 -6.47507019
C  -6.26046678 -3.60463217 -5.81790698
C  -7.21616478 -2.04026418 -7.36409534
H  -5.32330178 -1.05472735 -6.97226083
H  -6.67395634 -0.31256715 -6.08731405
C  -6.6296717 -3.44876498 -7.29019813
H  -7.08766511 -4.00167044 -5.2306212
H  -5.37725221 -4.21895368 -5.65360606
H  -8.23763536 -2.01553101 -6.97284754
H  -7.22759672 -1.63446303 -8.3762911
H  -7.32962068 -4.22614615 -7.59808562
H  -5.73713079 -3.52359265 -7.9170947
N  -5.98489801 -2.18475746 -5.30961517
H  -6.66898412 -1.98755209 -4.57186543
