program: Gaussian 09
title: 000049752
version: EM64L-G09RevD.01
frameworkgroup: C1[X(C13H15N3O2)]
method: RPBEPBE
basis: SDD
operation: Freq
keyword: #p
keyword: freq=noraman
keyword: PBEPBE/SDD
title: #p freq=noraman PBEPBE/SDD
converged: YES YES NO NO
title: Mulliken charges:
elementType: O O N N N C C C C C C C C C C C C C H H H H H H H H H H H H H H H
charge: -0.288851 -0.172549 -0.396746 -0.081851 -0.121633 -0.036895 -0.575810 -0.686242 -0.706145 0.218171 0.232204 0.312594 0.116038 -0.362434 -0.350328 -0.220099 -0.219558 -0.231383 0.212461 0.215984 0.249573 0.247605 0.206796 0.214950 0.198551 0.230668 0.226291 0.339324 0.252593 0.275441 0.231602 0.235249 0.234430
chargesum: 0.00000
title: Mulliken charges with hydrogens summed into heavy atoms:
elementType: O O N N N C C C C C C C C C C C C C
charge: -0.288851 -0.172549 -0.057422 -0.081851 -0.121633 0.175566 -0.110253 -0.016891 -0.050635 0.218171 0.232204 0.312594 0.116038 -0.109841 -0.074888 0.011503 0.015691 0.003047
polarizability: 2.94483676e+02 -1.67544019e+01 1.57416842e+02 -1.15488314e+01 -1.48498765e+01 9.72428816e+01
1716.lowfreq: -14.2705 -3.1870 0.0002 0.0004 0.0008 3.1157 9.1461 25.0662 36.3239
frequency: 3.8825 24.1947 36.2820 54.8483 66.1490 89.9209 105.5216 146.6789 171.0063 209.6749 230.2446 245.2478 267.4090 297.4114 338.6081 351.7050 361.4127 401.8464 402.1077 449.7337 475.1314 488.3212 560.1642 603.1550 613.6164 646.7880 675.1629 684.0264 698.6603 714.7738 774.2686 778.6277 796.2134 858.7757 863.7922 876.2886 895.7490 905.2383 924.3183 939.7633 956.5830 959.4370 965.6197 988.5561 989.0582 992.7885 1005.7381 1030.0400 1063.3612 1084.8872 1100.5718 1140.2104 1173.7515 1175.4254 1185.6938 1190.0348 1245.7373 1256.5780 1261.5512 1324.0061 1327.4658 1346.8774 1383.9432 1385.0859 1403.2934 1435.3967 1453.4433 1457.0547 1465.7757 1471.9892 1480.8405 1485.9545 1489.0062 1526.0693 1555.8983 1587.6492 1616.9690 1650.2516 2968.1455 2971.1510 2982.3143 2991.4270 3059.6097 3066.9715 3074.6304 3078.0047 3088.9562 3132.7457 3143.3967 3155.9116 3165.2859 3174.2925 3546.7798
redmass: 3.7232 5.6117 4.3188 3.7235 5.4975 4.5786 5.0032 5.6694 4.6837 1.1217 4.7903 5.0988 1.0467 4.4480 4.8648 5.1171 2.4477 2.4774 2.8132 3.6213 4.9787 3.8264 4.3043 1.2548 6.4673 5.6616 6.4772 7.2311 1.8764 4.7936 4.9434 1.8642 3.8178 1.2481 7.8374 8.8737 2.1849 3.6849 1.2533 1.4154 2.8199 1.9516 2.6761 5.9559 1.3968 6.7145 1.3302 2.0743 1.8961 1.6135 1.4883 3.7268 2.3719 1.0557 2.2031 1.1199 1.5336 2.7343 1.5369 1.3529 1.5106 1.3585 7.8930 1.2189 1.2148 2.4198 2.4052 1.2233 1.0485 1.0702 1.3981 1.0653 1.1513 5.4139 9.1467 6.3323 6.0421 7.1755 1.0371 1.0786 1.0381 1.0666 1.0986 1.0992 1.0998 1.0991 1.0996 1.0853 1.0887 1.0931 1.0965 1.1013 1.0768
irintensity: 0.8960 1.7909 0.1117 0.7654 5.3856 1.5531 2.9570 0.1956 2.4444 0.6830 0.3399 0.4716 0.1515 0.4027 0.3357 1.4001 0.3477 0.2988 0.0144 1.6297 2.0944 2.5307 16.6740 88.8643 0.2178 2.0955 9.5015 34.5054 52.6952 23.3447 9.2515 45.2235 3.1078 0.0213 16.8118 36.0926 9.3468 10.6482 6.1980 5.4883 21.4802 1.7792 11.7322 0.1310 0.0489 5.4803 0.4312 12.8548 68.1239 7.5396 6.2688 8.8532 127.7769 0.0076 38.0457 4.1069 2.5714 38.7437 68.9689 5.2500 1.4902 1.1780 1.7708 22.5873 21.5016 89.2130 47.4923 70.2961 6.4603 6.5800 261.1009 12.9790 120.3908 131.7989 443.2677 4.4386 0.1407 126.1148 32.2443 17.7973 37.1651 32.4579 28.5377 21.6384 17.3647 60.8408 49.6196 0.3222 8.8509 18.5170 13.5384 17.2963 31.7840
temp: 298.150 k
press: 1.00000 atm
elementType: 8 8 7 7 7 6 6 6 6 6 6 6 6 6 6 6 6 6 1 1 1 1 1 1 1 1 1 1 1 1 1 1 1
symmnumber: 1
zpe: 683300.6 jmol-1
zpe.correction: 0.260255 hartree
zpe.thermalcorrener: 0.277387 hartree
zpe.thermalcorrenthalpy: 0.278332 hartree
zpe.thermalcorrgfe: 0.211130 hartree
zpe.sumelectzpe: -817.742919 hartree
zpe.sumelectthermal: -817.725787 hartree
zpe.sumelectthermalent: -817.724843 hartree
zpe.sumelectthermalfe: -817.792044 hartree
dipole: -0.5417 6.8879 -1.4268
dipole: 7.0550
quadrupole: -80.7826 -114.2785 -106.4077
quadrupole: 9.2411 -3.4168 -2.2014
quadrupole: 19.7070 -13.7889 -5.9181 9.2411 -3.4168 -2.2014
hfenergy: -818.003174 hartree
pointgroup: C01 [X(C13H15N3O2)]
dipole: 0.2345603 -2.6376785 -0.8317767 debye
polarizability: 295.1878377|-15.6205564|153.4396534|6.4139098|20.889824|100.5159083 unknown
InChI: InChI=1S/C13H15N3O2/c1-9(2)8-11(17)14-13-16-15-12(18-13)10-6-4-3-5-7-10/h3-7,9,14H,8H2,1-2H3
charge 0 multiplicity 1
33 atoms
O  0.52444 -0.333651 -0.402291
O  -3.306947 1.644135 -0.119658
N  -1.810306 -0.104411 -0.578924
N  -0.329895 1.667314 0.355639
N  1.107898 1.672803 0.52246
C  -4.987546 -1.163969 0.148237
C  -4.212997 -0.460769 -1.018763
C  -5.756262 -0.148335 1.024511
C  -4.060888 -2.058574 1.005473
C  -3.108426 0.477818 -0.534897
C  -0.618559 0.481631 -0.18624
C  2.953735 0.021461 0.032871
C  1.579758 0.50586 0.07921
C  3.26358 -1.265977 -0.482924
C  3.997342 0.861009 0.51323
C  4.602998 -1.706063 -0.516431
C  5.331509 0.412129 0.475138
C  5.640153 -0.87095 -0.039017
H  -5.731276 -1.820486 -0.349551
H  -3.807714 -1.233817 -1.70111
H  -4.927497 0.156085 -1.592346
H  -5.067066 0.56116 1.514959
H  -6.329287 -0.675318 1.809621
H  -6.466596 0.445811 0.42132
H  -3.510521 -2.794202 0.386544
H  -3.322916 -1.45235 1.563283
H  -4.651715 -2.62536 1.747457
H  -1.730863 -1.063865 -0.922879
H  2.459259 -1.909851 -0.852392
H  3.743633 1.850325 0.907017
H  4.838166 -2.698904 -0.914725
H  6.132182 1.061182 0.845374
H  6.679522 -1.215772 -0.067096
