program: Gaussian 16
title: Title Card Required
version: ES64L-G16RevC.02
basis: 6-31+G(d,p)
method: UwB97XD TD-FC
operation: Force
keyword: #p
keyword: td=(nstates=40,root=2)
keyword: uwb97xd/6-31+g(d,p)
keyword: force
keyword: scrf=(CPCM,solvent=chloroform)
keyword: nosymm
keyword: scf=xqc
keyword: Guess=mix
keyword: density=current
title: #p td=(nstates=40,root=2) uwb97xd/6-31+g(d,p) force scrf=(CPCM,solvent
basis: NPDir=0 NMtPBC= 1 NCelOv= 1 NCel= 1 NClECP= 1 NCelD= 1
basis: NCelK= 1 NCelE2= 1 NClLst= 1 CellRange= 0.0.
basis: One-electron integrals computed using PRISM.
basis: NBasis= 859 RedAO= T EigKep= 1.06D-06 NBF= 859
basis: NBsUse= 854 1.00D-06 EigRej= 7.36D-07 NBFU= 854
converged: NO NO NO NO
hfenergy: -1479.2116651 hartree
pointgroup: C01 [X(C32H35N3O1)]
dipole: -1.7445996 -0.1785588 -3.7586582 debye
InChI: InChI=1/32C.3N.O.35H
charge 2 multiplicity 1
71 atoms
C  0.59772218 -2.25733006 -0.53238411
C  -0.60000575 -1.98021138 -1.26461279
C  -0.86240841 -0.66896112 -1.7084846
C  0.09748876 0.31257081 -1.4829627
C  1.28337798 0.00669009 -0.7987997
C  1.55348834 -1.27819865 -0.30451186
C  -0.57724039 -4.16953446 -0.69380529
C  -1.34947303 -3.19803103 -1.34954428
H  -1.79392025 -0.41912811 -2.20368924
H  -0.08124896 1.32598409 -1.82336653
H  2.01564265 0.78724265 -0.63034552
H  2.47041941 -1.49378697 0.22486993
N  0.56060589 -3.59808085 -0.15607782
H  -0.79697917 -5.2155089 -0.56914385
C  1.4729497 -4.22344441 0.73766438
O  2.46313317 -3.61616822 1.08422892
C  1.10889709 -5.5868975 1.26633533
H  0.69836185 -6.23899092 0.49105231
H  2.0485032 -6.02701438 1.60170213
C  0.1411261 -5.48330734 2.47585249
H  0.53165063 -4.74284059 3.18139638
H  0.16754661 -6.45577826 2.97850469
C  -1.28013738 -5.15860562 2.11133171
H  -1.83075649 -5.94004023 1.58761584
C  -1.89751554 -4.00841942 2.39399823
H  -1.38749389 -3.20733315 2.9238248
H  -2.93148986 -3.8376414 2.11041815
C  -2.66399121 -3.37153617 -1.85583963
H  -3.33072098 -4.1078893 -1.41939898
N  -3.11958813 -2.68055182 -2.9291191
H  -2.44689307 -2.23088929 -3.53568466
C  -3.00884226 -0.11023106 -5.00364909
C  -4.25360646 -0.54242355 -4.53590894
C  -5.09200553 0.37142291 -3.88863292
C  -4.68252162 1.68719091 -3.70087111
C  -3.42807464 2.10367309 -4.14510126
C  -2.59068863 1.20307282 -4.79798998
H  -2.3613389 -0.79646951 -5.54409623
H  -6.06905715 0.07248929 -3.52085538
H  -5.34363886 2.38745892 -3.20159443
H  -3.1109877 3.12989439 -3.9928346
H  -1.61850911 1.52064586 -5.1590768
C  -4.61499558 -2.00086805 -4.71438616
H  -3.93859765 -2.43944872 -5.45460296
C  -4.48132871 -2.839697 -3.40421793
H  -4.63037451 -3.89412197 -3.6735009
C  -5.50493614 -2.49390658 -2.33262152
C  -6.71650731 -3.19056499 -2.30004218
C  -5.27018988 -1.49081469 -1.38799445
C  -7.70059476 -2.85878634 -1.37043075
H  -6.88911759 -4.01913333 -2.98179263
C  -6.24664258 -1.16905609 -0.45094509
H  -4.32528981 -0.95810767 -1.38686241
C  -7.46716452 -1.84387334 -0.44647288
H  -8.63804232 -3.40393326 -1.36108129
H  -6.0561135 -0.38735766 0.27676758
H  -8.22787373 -1.5885028 0.28362305
C  -6.27722147 -1.24893424 -6.47446313
C  -6.2634934 -3.60554516 -5.81534943
C  -7.21677471 -2.04218424 -7.36398871
H  -5.32384913 -1.0578462 -6.96996678
H  -6.67555817 -0.31321596 -6.08862216
C  -6.63073814 -3.45056246 -7.28808688
H  -7.09073916 -4.00312028 -5.2287737
H  -5.37964713 -4.21880664 -5.64928989
H  -8.23848721 -2.01659862 -6.9733722
H  -7.22726323 -1.63708723 -8.37648433
H  -7.33046244 -4.22789357 -7.59675102
H  -5.73727786 -3.52637232 -7.91393701
N  -5.98862469 -2.18539619 -5.30760372
H  -6.67294491 -1.98764659 -4.57054404
