program: Gaussian 16
title: Title Card Required
version: ES64L-G16RevC.02
basis: 6-31+G(d,p)
method: UwB97XD TD-FC
operation: Force
keyword: #p
keyword: td=(nstates=40,root=2)
keyword: uwb97xd/6-31+g(d,p)
keyword: force
keyword: scrf=(CPCM,solvent=chloroform)
keyword: nosymm
keyword: scf=xqc
keyword: Guess=mix
keyword: density=current
title: #p td=(nstates=40,root=2) uwb97xd/6-31+g(d,p) force scrf=(CPCM,solvent
basis: NPDir=0 NMtPBC= 1 NCelOv= 1 NCel= 1 NClECP= 1 NCelD= 1
basis: NCelK= 1 NCelE2= 1 NClLst= 1 CellRange= 0.0.
basis: One-electron integrals computed using PRISM.
basis: NBasis= 859 RedAO= T EigKep= 1.08D-06 NBF= 859
basis: NBsUse= 854 1.00D-06 EigRej= 7.35D-07 NBFU= 854
converged: NO NO NO NO
hfenergy: -1479.2120298 hartree
pointgroup: C01 [X(C32H35N3O1)]
dipole: -2.8434999 -0.547872 -4.1492303 debye
InChI: InChI=1/32C.3N.O.35H
charge 2 multiplicity 1
71 atoms
C  0.59852857 -2.25631925 -0.53160834
C  -0.59628274 -1.98025877 -1.26752611
C  -0.86027677 -0.66810541 -1.70812725
C  0.10127866 0.31265758 -1.48440211
C  1.28682683 0.00707618 -0.79981354
C  1.55481379 -1.2785799 -0.30153535
C  -0.57334954 -4.17168986 -0.69765884
C  -1.34312862 -3.19990163 -1.35802902
H  -1.79168379 -0.41447326 -2.20366503
H  -0.07159188 1.3242032 -1.83186395
H  2.02381561 0.78645203 -0.63791534
H  2.4691873 -1.49337259 0.23143621
N  0.55995468 -3.59871117 -0.15334561
H  -0.79602041 -5.21721982 -0.5749066
C  1.4702179 -4.22323802 0.74295622
O  2.45695953 -3.61368898 1.09681857
C  1.10868277 -5.58784277 1.26683258
H  0.69806116 -6.23892468 0.49072762
H  2.04898283 -6.02869439 1.60201876
C  0.14059876 -5.48497295 2.47570643
H  0.53286328 -4.74435665 3.18002636
H  0.16659165 -6.45661258 2.97863335
C  -1.28081217 -5.16063828 2.11166813
H  -1.83241851 -5.94249653 1.58883797
C  -1.89744887 -4.01002773 2.39458675
H  -1.38686776 -3.20841457 2.92326707
H  -2.93268319 -3.84071264 2.11484237
C  -2.65699123 -3.36946654 -1.86278302
H  -3.3206008 -4.10841784 -1.42589864
N  -3.11865395 -2.67524471 -2.92972201
H  -2.45112546 -2.20917744 -3.52993936
C  -3.01073747 -0.11109906 -5.00390867
C  -4.25578632 -0.54182354 -4.5373387
C  -5.09388682 0.37153779 -3.88908545
C  -4.68421478 1.68734326 -3.70165335
C  -3.42941008 2.10305714 -4.14590098
C  -2.59167541 1.20161017 -4.79717517
H  -2.36282058 -0.79880514 -5.5428377
H  -6.0694412 0.0707255 -3.51951537
H  -5.34546238 2.3875549 -3.20239368
H  -3.11224229 3.12917266 -3.99401992
H  -1.61796766 1.51789602 -5.15547288
C  -4.61695004 -1.99997966 -4.7148245
H  -3.94115113 -2.43818672 -5.45533401
C  -4.48077005 -2.83737131 -3.40337971
H  -4.62470269 -3.89234567 -3.67201206
C  -5.50521317 -2.49432411 -2.33227573
C  -6.71710743 -3.18982335 -2.30021675
C  -5.27205597 -1.49152329 -1.38623952
C  -7.70228329 -2.85883939 -1.37075137
H  -6.89054633 -4.01729951 -2.98328734
C  -6.2488855 -1.16957076 -0.44979131
H  -4.32787886 -0.95750937 -1.38726797
C  -7.47030531 -1.84403274 -0.44641598
H  -8.63910342 -3.40502711 -1.36118682
H  -6.05833502 -0.38787864 0.27774502
H  -8.23179932 -1.58797498 0.28308839
C  -6.27785857 -1.24992819 -6.47429674
C  -6.26487376 -3.6061597 -5.81410717
C  -7.2168867 -2.0428323 -7.36404072
H  -5.32364795 -1.05893016 -6.96866749
H  -6.67613983 -0.31338941 -6.08942401
C  -6.63126461 -3.45153851 -7.28743513
H  -7.09255666 -4.00412679 -5.22794792
H  -5.38104754 -4.21898373 -5.64773547
H  -8.23861338 -2.01678886 -6.97339884
H  -7.2275606 -1.63818822 -8.37678306
H  -7.33115179 -4.22865912 -7.59607128
H  -5.73736295 -3.52784303 -7.91233198
N  -5.99076695 -2.18571395 -5.30694721
H  -6.67603388 -1.98752127 -4.57035935
