program: Gaussian 16
title: Title Card Required
version: ES64L-G16RevC.02
basis: 6-31+G(d,p)
method: UwB97XD TD-FC
operation: Force
keyword: #p
keyword: td=(nstates=40,root=3)
keyword: uwb97xd/6-31+g(d,p)
keyword: force
keyword: scrf=(CPCM,solvent=chloroform)
keyword: nosymm
keyword: scf=xqc
keyword: Guess=mix
keyword: density=current
title: #p td=(nstates=40,root=3) uwb97xd/6-31+g(d,p) force scrf=(CPCM,solvent
basis: NPDir=0 NMtPBC= 1 NCelOv= 1 NCel= 1 NClECP= 1 NCelD= 1
basis: NCelK= 1 NCelE2= 1 NClLst= 1 CellRange= 0.0.
basis: One-electron integrals computed using PRISM.
basis: NBasis= 859 RedAO= T EigKep= 1.07D-06 NBF= 859
basis: NBsUse= 854 1.00D-06 EigRej= 7.43D-07 NBFU= 854
converged: NO NO NO NO
hfenergy: -1479.212728 hartree
pointgroup: C01[X(C32H35N3O1)]
dipole: -1.7790598 -0.1574976 -3.7902271 debye
InChI: InChI=1/32C.3N.O.35H
charge 2 multiplicity 1
71 atoms
C  0.60508016 -2.25581632 -0.52874548
C  -0.58551914 -1.97842432 -1.26872438
C  -0.84568046 -0.6677021 -1.71304704
C  0.11848865 0.3116217 -1.49607933
C  1.29906324 0.00604748 -0.80790544
C  1.55777545 -1.27799687 -0.29577517
C  -0.5665534 -4.16861306 -0.70387007
C  -1.33603975 -3.19313791 -1.3625624
H  -1.77975018 -0.42317018 -2.20394629
H  -0.04564258 1.32191441 -1.85146079
H  2.03413963 0.78714751 -0.65330153
H  2.46324327 -1.48983433 0.25205882
N  0.56404768 -3.59972831 -0.15148246
H  -0.78511377 -5.2177304 -0.60137266
C  1.46803584 -4.22082931 0.75305219
O  2.4490753 -3.60856505 1.11829338
C  1.10728641 -5.58872338 1.27176734
H  0.69857197 -6.23713221 0.49281028
H  2.04642231 -6.02972508 1.60631125
C  0.14003167 -5.49082368 2.48076666
H  0.53218414 -4.75385644 3.18864121
H  0.16439902 -6.46317133 2.98355003
C  -1.28077447 -5.16524111 2.11677843
H  -1.83164855 -5.94906861 1.59712969
C  -1.89752089 -4.01484727 2.40042077
H  -1.38344503 -3.20955312 2.9199098
H  -2.93514409 -3.84806146 2.12838292
C  -2.64647454 -3.37032715 -1.88007231
H  -3.29759683 -4.12893743 -1.46034409
N  -3.12092291 -2.66820298 -2.93637479
H  -2.47550821 -2.14177851 -3.5122903
C  -3.01330699 -0.11230118 -5.00284328
C  -4.25975286 -0.54183264 -4.53800755
C  -5.09756753 0.37145802 -3.88900722
C  -4.68740016 1.68722655 -3.70254231
C  -3.4312946 2.10132315 -4.14378454
C  -2.5929489 1.19959833 -4.79471712
H  -2.36556597 -0.80146681 -5.54013698
H  -6.07212634 0.07116852 -3.51676667
H  -5.35100393 2.38849678 -3.20811071
H  -3.11323543 3.12716286 -3.99105065
H  -1.62002169 1.51549419 -5.15470039
C  -4.62199066 -1.999736 -4.71499076
H  -3.94458604 -2.44038452 -5.45355616
C  -4.48520792 -2.83145569 -3.40320662
H  -4.62957366 -3.88825492 -3.67196738
C  -5.51113252 -2.48936623 -2.33277231
C  -6.72145168 -3.18795957 -2.30188202
C  -5.27807672 -1.48836545 -1.38609975
C  -7.70708781 -2.85884498 -1.37252087
H  -6.89043881 -4.01744679 -2.98357233
C  -6.25546662 -1.16862667 -0.44957939
H  -4.33220483 -0.95657856 -1.38169044
C  -7.4764083 -1.84314912 -0.44848659
H  -8.64104548 -3.41003318 -1.36056553
H  -6.06248372 -0.39132364 0.28215656
H  -8.23820286 -1.58761016 0.28059073
C  -6.27943824 -1.25102828 -6.47486368
C  -6.26792834 -3.60696813 -5.81305576
C  -7.21799902 -2.04450875 -7.36464558
H  -5.32464168 -1.06075958 -6.96829634
H  -6.67682801 -0.31465213 -6.08976349
C  -6.63301461 -3.45352129 -7.28654191
H  -7.09606198 -4.00381692 -5.2274449
H  -5.38461558 -4.22051375 -5.64478291
H  -8.23941348 -2.01828171 -6.97382741
H  -7.22759541 -1.63991499 -8.37731752
H  -7.33330361 -4.2306198 -7.59464311
H  -5.7385196 -3.53141994 -7.91054224
N  -5.99436795 -2.18588534 -5.30689123
H  -6.68027052 -1.987325 -4.57147156
