program: Gaussian 16
title: Title Card Required
version: ES64L-G16RevC.02
basis: 6-31+G(d,p)
method: UwB97XD TD-FC
operation: Force
keyword: #p
keyword: td=(nstates=40,root=2)
keyword: uwb97xd/6-31+g(d,p)
keyword: force
keyword: scrf=(CPCM,solvent=chloroform)
keyword: nosymm
keyword: scf=xqc
keyword: Guess=mix
keyword: density=current
title: #p td=(nstates=40,root=2) uwb97xd/6-31+g(d,p) force scrf=(CPCM,solvent
basis: NPDir=0 NMtPBC= 1 NCelOv= 1 NCel= 1 NClECP= 1 NCelD= 1
basis: NCelK= 1 NCelE2= 1 NClLst= 1 CellRange= 0.0.
basis: One-electron integrals computed using PRISM.
basis: NBasis= 859 RedAO= T EigKep= 1.08D-06 NBF= 859
basis: NBsUse= 854 1.00D-06 EigRej= 7.48D-07 NBFU= 854
converged: NO NO NO NO
hfenergy: -1479.2136132 hartree
pointgroup: C01[X(C32H35N3O1)]
dipole: -1.8058155 -0.1656335 -3.7993387 debye
InChI: InChI=1/32C.3N.O.35H
charge 2 multiplicity 1
71 atoms
C  0.60633998 -2.2553813 -0.52571905
C  -0.58308981 -1.97866882 -1.26857151
C  -0.836227 -0.66636388 -1.71853346
C  0.12733833 0.31161169 -1.50655031
C  1.30436444 0.00502456 -0.81087475
C  1.55852532 -1.27633886 -0.29205622
C  -0.56318742 -4.16703922 -0.70419813
C  -1.33301431 -3.19111048 -1.36475724
H  -1.77042326 -0.42127819 -2.21177194
H  -0.03205544 1.32242537 -1.86505303
H  2.04020095 0.78611419 -0.65621767
H  2.46277802 -1.49085462 0.25998748
N  0.5654549 -3.59930483 -0.15152866
H  -0.77715084 -5.21722907 -0.61194284
C  1.46679623 -4.22046425 0.75710791
O  2.4465816 -3.60589749 1.12432686
C  1.10656165 -5.58778151 1.27469091
H  0.69798408 -6.23621728 0.4954635
H  2.04677226 -6.02854617 1.60985654
C  0.1396577 -5.49429068 2.4865278
H  0.53138384 -4.75941767 3.19673415
H  0.16457464 -6.46890581 2.98518752
C  -1.28106311 -5.16905526 2.12333251
H  -1.83200382 -5.95289385 1.60373389
C  -1.89665635 -4.01747602 2.40397658
H  -1.38184322 -3.21146245 2.92164387
H  -2.93525338 -3.85050557 2.13272678
C  -2.63770001 -3.37638049 -1.89196466
H  -3.27993172 -4.14944695 -1.48705959
N  -3.12446986 -2.66861925 -2.93752653
H  -2.49305161 -2.10272822 -3.48780985
C  -3.0149928 -0.11228138 -5.00258218
C  -4.26163923 -0.54152619 -4.53872274
C  -5.09950221 0.37208534 -3.8900723
C  -4.68876243 1.68725054 -3.70277957
C  -3.43170856 2.1013541 -4.14295643
C  -2.5943103 1.19968821 -4.79398186
H  -2.36716042 -0.8011659 -5.54040243
H  -6.07503797 0.07266813 -3.5190813
H  -5.35253289 2.3888111 -3.20891168
H  -3.11331167 3.1263635 -3.98810384
H  -1.6214253 1.51595992 -5.15496622
C  -4.62297173 -1.99905074 -4.71570307
H  -3.94590639 -2.44153401 -5.45195106
C  -4.48719105 -2.83196699 -3.40194121
H  -4.63168719 -3.88492836 -3.66994931
C  -5.51335593 -2.48791433 -2.33329632
C  -6.72234465 -3.18652943 -2.30122911
C  -5.28107586 -1.48613883 -1.38488315
C  -7.70891361 -2.85966108 -1.37274841
H  -6.89101084 -4.01784531 -2.98300546
C  -6.25941584 -1.16829086 -0.44907525
H  -4.33536085 -0.95499219 -1.37825803
C  -7.47973575 -1.84299806 -0.44819663
H  -8.64323829 -3.41064484 -1.36115396
H  -6.06655849 -0.39119729 0.28414413
H  -8.24159215 -1.58807311 0.28005385
C  -6.28082836 -1.25153876 -6.47599751
C  -6.2697754 -3.60705384 -5.8131369
C  -7.21909731 -2.04508656 -7.36572308
H  -5.32602972 -1.06145555 -6.96974773
H  -6.67848451 -0.31466324 -6.09131062
C  -6.63438774 -3.45437564 -7.28694921
H  -7.09869107 -4.00317882 -5.22760475
H  -5.38693629 -4.22078617 -5.64419593
H  -8.24111398 -2.01889517 -6.97519702
H  -7.22845391 -1.64115908 -8.37867425
H  -7.33476514 -4.23148377 -7.59465632
H  -5.7399244 -3.53267662 -7.91081914
N  -5.99577678 -2.18611396 -5.30814142
H  -6.68225583 -1.98678252 -4.57263319
