program: Gaussian 16
title: Title Card Required
version: ES64L-G16RevC.02
basis: 6-31+G(d,p)
method: UwB97XD TD-FC
operation: Force
keyword: #p
keyword: td=(nstates=40,root=3)
keyword: uwb97xd/6-31+g(d,p)
keyword: force
keyword: scrf=(CPCM,solvent=chloroform)
keyword: nosymm
keyword: scf=xqc
keyword: Guess=mix
keyword: density=current
title: #p td=(nstates=40,root=3) uwb97xd/6-31+g(d,p) force scrf=(CPCM,solvent
basis: NPDir=0 NMtPBC= 1 NCelOv= 1 NCel= 1 NClECP= 1 NCelD= 1
basis: NCelK= 1 NCelE2= 1 NClLst= 1 CellRange= 0.0.
basis: One-electron integrals computed using PRISM.
basis: NBasis= 859 RedAO= T EigKep= 1.10D-06 NBF= 859
basis: NBsUse= 854 1.00D-06 EigRej= 7.46D-07 NBFU= 854
converged: NO NO NO NO
hfenergy: -1479.2132825 hartree
pointgroup: C01 [X(C32H35N3O1)]
dipole: -2.859884 -0.4273634 -4.1947093 debye
InChI: InChI=1/32C.3N.O.35H
charge 2 multiplicity 1
71 atoms
C  0.60985945 -2.25001616 -0.52103543
C  -0.58054225 -1.9732459 -1.26423909
C  -0.83060444 -0.66371147 -1.72765177
C  0.14100004 0.31030184 -1.52203333
C  1.31366378 0.00623417 -0.81485035
C  1.56397284 -1.27374967 -0.28697867
C  -0.55638073 -4.16682838 -0.71243784
C  -1.32875444 -3.19058457 -1.36886263
H  -1.76546706 -0.4136716 -2.2170741
H  -0.02110196 1.32034022 -1.88313107
H  2.05328551 0.78197006 -0.65609063
H  2.46522978 -1.48401866 0.27267234
N  0.569518 -3.59889079 -0.14897656
H  -0.75702641 -5.22376443 -0.6378061
C  1.4639219 -4.21943754 0.76117906
O  2.44320974 -3.60530571 1.12830756
C  1.10586127 -5.58785991 1.28217385
H  0.69425547 -6.23327863 0.50228971
H  2.04749361 -6.02841128 1.61340764
C  0.13889986 -5.49771571 2.49289859
H  0.52869833 -4.76674675 3.20936635
H  0.16500269 -6.47582323 2.98345995
C  -1.28257019 -5.17332715 2.13022078
H  -1.83529483 -5.95982281 1.61535759
C  -1.89679569 -4.02028864 2.40754075
H  -1.3808402 -3.21294558 2.92321194
H  -2.93515948 -3.85433828 2.13865591
C  -2.636218 -3.37733823 -1.89297503
H  -3.26968199 -4.17456082 -1.51037591
N  -3.12119297 -2.67335005 -2.94417639
H  -2.50742491 -2.06255444 -3.47049109
C  -3.01619115 -0.11164835 -5.00209117
C  -4.26351684 -0.54164914 -4.53804357
C  -5.10147649 0.3732565 -3.89116815
C  -4.69012706 1.68853402 -3.70336041
C  -3.43211257 2.1019707 -4.1411277
C  -2.59574887 1.20054779 -4.79387879
H  -2.36936653 -0.79954345 -5.54151336
H  -6.07911929 0.0768159 -3.52398824
H  -5.35392692 2.39129013 -3.21176728
H  -3.11218027 3.12636633 -3.98337661
H  -1.62354785 1.51749698 -5.15587693
C  -4.62577926 -2.00034126 -4.71520801
H  -3.9457649 -2.44277193 -5.44967623
C  -4.49035354 -2.83012413 -3.40168525
H  -4.6420409 -3.8868952 -3.66594704
C  -5.5156624 -2.48578565 -2.33215054
C  -6.72477858 -3.18628276 -2.30103484
C  -5.28314795 -1.48547146 -1.38244168
C  -7.71216893 -2.85893687 -1.37338968
H  -6.88962809 -4.01908051 -2.97999736
C  -6.26334081 -1.16784797 -0.44803931
H  -4.33765808 -0.95445764 -1.37415364
C  -7.48405595 -1.84205058 -0.44925238
H  -8.64508733 -3.41188658 -1.36210665
H  -6.07328857 -0.39293767 0.28747418
H  -8.24627031 -1.59017862 0.27908008
C  -6.28288056 -1.25180038 -6.47789023
C  -6.27207228 -3.60720529 -5.81326777
C  -7.2208165 -2.04644447 -7.36700779
H  -5.32824733 -1.06198008 -6.97209614
H  -6.68073569 -0.3151115 -6.09324817
C  -6.63562883 -3.45523853 -7.28723708
H  -7.1017111 -4.00136615 -5.22767501
H  -5.38950406 -4.22124463 -5.64344433
H  -8.24271395 -2.02004542 -6.97766254
H  -7.22973781 -1.64289622 -8.37991529
H  -7.33607206 -4.23227927 -7.59450532
H  -5.74164673 -3.53425797 -7.91171757
N  -5.99718912 -2.18577297 -5.30922067
H  -6.68259136 -1.98629578 -4.57332734
