program: Gaussian 16
title: Title Card Required
version: ES64L-G16RevC.02
basis: 6-31+G(d,p)
method: UwB97XD TD-FC
operation: Force
keyword: #p
keyword: td=(nstates=40,root=2)
keyword: uwb97xd/6-31+g(d,p)
keyword: force
keyword: scrf=(CPCM,solvent=chloroform)
keyword: nosymm
keyword: scf=xqc
keyword: Guess=mix
keyword: density=current
title: #p td=(nstates=40,root=2) uwb97xd/6-31+g(d,p) force scrf=(CPCM,solvent
basis: NPDir=0 NMtPBC= 1 NCelOv= 1 NCel= 1 NClECP= 1 NCelD= 1
basis: NCelK= 1 NCelE2= 1 NClLst= 1 CellRange= 0.0.
basis: One-electron integrals computed using PRISM.
basis: NBasis= 859 RedAO= T EigKep= 1.10D-06 NBF= 859
basis: NBsUse= 854 1.00D-06 EigRej= 7.47D-07 NBFU= 854
converged: NO NO NO NO
hfenergy: -1479.2135277 hartree
pointgroup: C01 [X(C32H35N3O1)]
dipole: -2.8596041 -0.4075234 -4.1948047 debye
InChI: InChI=1/32C.3N.O.35H
charge 2 multiplicity 1
71 atoms
C  0.60954191 -2.24969974 -0.51951069
C  -0.57892038 -1.97366744 -1.26676485
C  -0.82424235 -0.66225948 -1.73438724
C  0.14899496 0.31015 -1.5280562
C  1.31869482 0.00525947 -0.81781429
C  1.5646619 -1.27502625 -0.28622797
C  -0.55201226 -4.16774652 -0.71342166
C  -1.32646428 -3.18771654 -1.36994317
H  -1.75648415 -0.40660332 -2.22657438
H  -0.01388853 1.31549742 -1.89502147
H  2.0601859 0.77858612 -0.65324522
H  2.46531046 -1.47960846 0.27651329
N  0.56687648 -3.59819589 -0.14543196
H  -0.75191105 -5.22453973 -0.64107403
C  1.46365803 -4.21782568 0.76569867
O  2.44244 -3.60473082 1.13282425
C  1.10623015 -5.5864047 1.28569148
H  0.69362253 -6.2327996 0.508131
H  2.04848322 -6.02757341 1.61521
C  0.13926954 -5.50013652 2.49619737
H  0.52788282 -4.77172324 3.21509008
H  0.16634999 -6.47987944 2.98303938
C  -1.28204133 -5.17605679 2.13336227
H  -1.83642735 -5.96295612 1.62170886
C  -1.89568026 -4.0221629 2.41072008
H  -1.38003707 -3.2152633 2.92645584
H  -2.93392456 -3.85578234 2.14076828
C  -2.6333495 -3.38061209 -1.90045972
H  -3.25343671 -4.1951056 -1.53760375
N  -3.12076978 -2.67451953 -2.94784832
H  -2.52287036 -2.02876325 -3.44581584
C  -3.01767376 -0.1112503 -5.00267665
C  -4.26451747 -0.54151797 -4.53878464
C  -5.10302718 0.37393332 -3.89229857
C  -4.69079577 1.68892335 -3.7032418
C  -3.4329287 2.10213411 -4.13976433
C  -2.59673857 1.20118527 -4.79384038
H  -2.37049186 -0.79915114 -5.54209221
H  -6.08150169 0.07811309 -3.52717526
H  -5.35458731 2.39201369 -3.21134633
H  -3.11220438 3.12624525 -3.98098202
H  -1.6249407 1.51820855 -5.1559051
C  -4.62659952 -2.00045658 -4.71583529
H  -3.94590136 -2.44320631 -5.44895793
C  -4.4919514 -2.8314302 -3.40070659
H  -4.64400943 -3.88672615 -3.66146018
C  -5.51692397 -2.48419833 -2.3300457
C  -6.72636988 -3.18573904 -2.30058746
C  -5.28565863 -1.48520934 -1.38130586
C  -7.7143432 -2.85752901 -1.37343737
H  -6.89007573 -4.01894898 -2.97892562
C  -6.26625387 -1.16702786 -0.44661816
H  -4.33958279 -0.95321846 -1.37329202
C  -7.48710767 -1.84263161 -0.44974551
H  -8.64662614 -3.41230207 -1.36216422
H  -6.07783663 -0.3924685 0.28831241
H  -8.24943895 -1.59132533 0.27972508
C  -6.28403041 -1.25219496 -6.47904233
C  -6.27348567 -3.60694711 -5.81362996
C  -7.22196732 -2.04694706 -7.36821985
H  -5.32972203 -1.06236174 -6.97375292
H  -6.68207616 -0.31532769 -6.09528975
C  -6.63698249 -3.45576765 -7.28780748
H  -7.103528 -4.00042006 -5.22812614
H  -5.39130313 -4.22138109 -5.6432652
H  -8.24423321 -2.02044133 -6.97938582
H  -7.2309146 -1.64388973 -8.38138578
H  -7.33750554 -4.23281891 -7.59490248
H  -5.74297021 -3.53495664 -7.91226432
N  -5.99845154 -2.18567926 -5.30981631
H  -6.68355599 -1.9857107 -4.5735498
