program: Gaussian 16
title: Title Card Required
version: ES64L-G16RevC.02
basis: 6-31+G(d,p)
method: UwB97XD TD-FC
operation: Force
keyword: #p
keyword: td=(nstates=40,root=2)
keyword: uwb97xd/6-31+g(d,p)
keyword: force
keyword: scrf=(CPCM,solvent=chloroform)
keyword: nosymm
keyword: scf=xqc
keyword: Guess=mix
keyword: density=current
title: #p td=(nstates=40,root=2) uwb97xd/6-31+g(d,p) force scrf=(CPCM,solvent
basis: NPDir=0 NMtPBC= 1 NCelOv= 1 NCel= 1 NClECP= 1 NCelD= 1
basis: NCelK= 1 NCelE2= 1 NClLst= 1 CellRange= 0.0.
basis: One-electron integrals computed using PRISM.
basis: NBasis= 859 RedAO= T EigKep= 1.13D-06 NBF= 859
basis: NBsUse= 854 1.00D-06 EigRej= 7.36D-07 NBFU= 854
converged: NO NO NO NO
hfenergy: -1479.2166243 hartree
pointgroup: C01 [X(C32H35N3O1)]
dipole: -2.2077894 -0.3630876 -3.803545 debye
InChI: InChI=1/32C.3N.O.35H
charge 2 multiplicity 1
71 atoms
C  0.60435998 -2.24769272 -0.51196665
C  -0.56515787 -1.97920654 -1.28573708
C  -0.78060945 -0.66265428 -1.78075925
C  0.18327898 0.30651073 -1.56186704
C  1.32983588 -0.00401007 -0.82474787
C  1.55751989 -1.29134048 -0.28545411
C  -0.54847354 -4.1582995 -0.69056675
C  -1.30805314 -3.18892847 -1.39645478
H  -1.68308386 -0.39730913 -2.31529522
H  0.04732843 1.31063789 -1.93884998
H  2.06452614 0.77137013 -0.64739334
H  2.45217571 -1.51683107 0.27765998
N  0.55745241 -3.59855572 -0.11632707
H  -0.79782826 -5.1970841 -0.54883121
C  1.45494524 -4.20936251 0.78864673
O  2.4337075 -3.59277018 1.16281716
C  1.11131765 -5.58585315 1.29912402
H  0.71105347 -6.2341647 0.51525771
H  2.0575811 -6.01718846 1.62941185
C  0.14588488 -5.51574821 2.51270289
H  0.53614609 -4.790021 3.23352154
H  0.17585946 -6.49816923 2.99548869
C  -1.27387253 -5.18898272 2.15068033
H  -1.82722887 -5.96995689 1.63078204
C  -1.886073 -4.03155459 2.42780317
H  -1.3706554 -3.23175171 2.95330509
H  -2.91928943 -3.85789036 2.1461047
C  -2.58604443 -3.41945632 -1.97660437
H  -3.11187213 -4.34114496 -1.74978552
N  -3.12534617 -2.64802031 -2.94925626
H  -2.65192648 -1.79993915 -3.22837168
C  -3.02408785 -0.1115903 -5.00872654
C  -4.2734985 -0.54073736 -4.54872028
C  -5.11171987 0.37250893 -3.89892252
C  -4.69759688 1.68500345 -3.69979039
C  -3.44004604 2.09907385 -4.13709462
C  -2.60397875 1.2005615 -4.79495272
H  -2.37456218 -0.80176589 -5.54181057
H  -6.09042992 0.07461141 -3.5361233
H  -5.3574959 2.38245014 -3.19505522
H  -3.11892435 3.12218337 -3.97348169
H  -1.629899 1.51794837 -5.15100665
C  -4.63526451 -2.000135 -4.71895685
H  -3.95348339 -2.4471378 -5.44731597
C  -4.49370421 -2.82027549 -3.39544095
H  -4.61639065 -3.87951944 -3.65290507
C  -5.52639567 -2.48085769 -2.32603771
C  -6.73593548 -3.18189172 -2.29805898
C  -5.30042566 -1.47914986 -1.37751594
C  -7.7241762 -2.85742437 -1.36939523
H  -6.90395112 -4.00939338 -2.98233781
C  -6.28149236 -1.16251653 -0.44334697
H  -4.36310957 -0.93243159 -1.3692224
C  -7.49913497 -1.84305439 -0.44306746
H  -8.65746995 -3.41039718 -1.36079072
H  -6.09626036 -0.3790174 0.2835904
H  -8.26191899 -1.59271812 0.28659813
C  -6.29032335 -1.25341717 -6.48672575
C  -6.2830128 -3.60694736 -5.81618651
C  -7.22917654 -2.04839982 -7.37496172
H  -5.3352359 -1.06638278 -6.98105508
H  -6.68790546 -0.31502604 -6.10606361
C  -6.64584855 -3.4577999 -7.29121963
H  -7.1136978 -4.00017503 -5.23152531
H  -5.40068977 -4.22088825 -5.64376205
H  -8.25163414 -2.01842193 -6.98671528
H  -7.23650368 -1.64793796 -8.38940621
H  -7.34651396 -4.2348483 -7.5985046
H  -5.75109368 -3.53768064 -7.91448962
N  -6.00780465 -2.18499224 -5.31422406
H  -6.69573568 -1.98233237 -4.58169029
