program: Gaussian 16
title: Title Card Required
version: ES64L-G16RevC.02
basis: 6-31+G(d,p)
method: UwB97XD TD-FC
operation: Force
keyword: #p
keyword: td=(nstates=40,root=2)
keyword: uwb97xd/6-31+g(d,p)
keyword: force
keyword: scrf=(CPCM,solvent=chloroform)
keyword: nosymm
keyword: scf=xqc
keyword: Guess=mix
keyword: density=current
title: #p td=(nstates=40,root=2) uwb97xd/6-31+g(d,p) force scrf=(CPCM,solvent
basis: NPDir=0 NMtPBC= 1 NCelOv= 1 NCel= 1 NClECP= 1 NCelD= 1
basis: NCelK= 1 NCelE2= 1 NClLst= 1 CellRange= 0.0.
basis: One-electron integrals computed using PRISM.
basis: NBasis= 859 RedAO= T EigKep= 1.13D-06 NBF= 859
basis: NBsUse= 854 1.00D-06 EigRej= 7.35D-07 NBFU= 854
converged: NO NO NO NO
hfenergy: -1479.2167508 hartree
pointgroup: C01 [X(C32H35N3O1)]
dipole: -2.8305507 -0.1317181 -4.1635312 debye
InChI: InChI=1/32C.3N.O.35H
charge 2 multiplicity 1
71 atoms
C  0.60769488 -2.25049152 -0.51394062
C  -0.56453185 -1.98165231 -1.28915686
C  -0.77521819 -0.66437001 -1.78364054
C  0.18505244 0.30463538 -1.56231402
C  1.3276523 -0.00612768 -0.82626865
C  1.55998302 -1.2934753 -0.28648204
C  -0.55521407 -4.15699038 -0.68090079
C  -1.30776168 -3.1876418 -1.39389709
H  -1.67858033 -0.39711734 -2.32097905
H  0.04456345 1.30971831 -1.9388659
H  2.06577387 0.76865821 -0.64408907
H  2.45258406 -1.51391808 0.27771092
N  0.55820413 -3.60083113 -0.11359935
H  -0.80676726 -5.19461121 -0.53708683
C  1.45513838 -4.20811378 0.78993556
O  2.43103749 -3.59125726 1.16628748
C  1.11339566 -5.5871145 1.29932888
H  0.7127837 -6.23506732 0.51541854
H  2.05944857 -6.01720024 1.62938311
C  0.14723164 -5.5157359 2.51214293
H  0.53697164 -4.78898083 3.23208389
H  0.17640499 -6.4977264 2.99534265
C  -1.27299793 -5.18753704 2.14975112
H  -1.82579779 -5.96904085 1.62805862
C  -1.88423961 -4.03300863 2.42772022
H  -1.36945492 -3.23256095 2.95494141
H  -2.91848753 -3.85803605 2.14675819
C  -2.58252317 -3.42032842 -1.98496466
H  -3.10476731 -4.34683886 -1.76840462
N  -3.12565105 -2.64308147 -2.95096894
H  -2.66423327 -1.78585328 -3.21718847
C  -3.02409306 -0.11195503 -5.0084187
C  -4.27402253 -0.541249 -4.54866177
C  -5.11167041 0.37148007 -3.8982775
C  -4.69794178 1.68421667 -3.69905263
C  -3.44042448 2.09853441 -4.13678565
C  -2.60441191 1.19997585 -4.79449705
H  -2.37462944 -0.80253313 -5.54075848
H  -6.0898761 0.07299064 -3.53429846
H  -5.35779344 2.38162108 -3.19454066
H  -3.11970586 3.12181477 -3.97367783
H  -1.63036932 1.51762529 -5.15101462
C  -4.63573802 -2.00066089 -4.71987468
H  -3.95394178 -2.44765205 -5.44800584
C  -4.49442677 -2.81960674 -3.39585225
H  -4.61499233 -3.87939078 -3.65001456
C  -5.52806863 -2.47966351 -2.32723379
C  -6.7368887 -3.18088204 -2.2988688
C  -5.3015993 -1.47791798 -1.37872299
C  -7.72458229 -2.8572248 -1.36941358
H  -6.90486383 -4.00880965 -2.98291168
C  -6.28230583 -1.16153241 -0.44435505
H  -4.36348041 -0.9328168 -1.37059504
C  -7.49946408 -1.84243546 -0.44311895
H  -8.65734409 -3.41104424 -1.35963769
H  -6.09652271 -0.37848836 0.28344364
H  -8.26180972 -1.59305404 0.2871702
C  -6.29034936 -1.25359212 -6.48663309
C  -6.28325316 -3.60705994 -5.81613306
C  -7.22918528 -2.04824168 -7.37498983
H  -5.33496598 -1.06704831 -6.98071627
H  -6.68733498 -0.31481857 -6.10604216
C  -6.64605515 -3.45782677 -7.29122357
H  -7.11380749 -4.00041729 -5.23144157
H  -5.40074572 -4.22066261 -5.64366451
H  -8.25167006 -2.01835754 -6.98672534
H  -7.23644058 -1.64767123 -8.38933564
H  -7.3469295 -4.23470016 -7.5984375
H  -5.7513166 -3.53794104 -7.91445407
N  -6.00818289 -2.18506217 -5.3144045
H  -6.69556072 -1.98253582 -4.5813205
