program: Gaussian 16
title: Title Card Required
version: ES64L-G16RevC.02
method: UwB97XD
basis: 6-31+G(d,p)
operation: Freq
keyword: #P
keyword: Geom=AllCheck
keyword: Guess=TCheck
keyword: SCRF=Check
keyword: GenChk
keyword: UwB97XD/6-31+G(d,p)
keyword: Freq
converged: YES YES YES YES
polarizability: 4.73136185e+02 3.46735685e+01 4.70105926e+02 2.35577498e+01 -2.37377032e+01 4.18518870e+02
1716.lowfreq: 0.0003 0.0004 0.0008 2.4282 3.3592 7.6146 8.3603 20.0846 27.6000
frequency: 8.1157 19.1119 27.4639 37.1229 50.3531 54.2332 62.6343 63.3317 72.8297 79.1360 96.8304 101.8660 110.8034 120.7203 155.3451 175.3709 185.8041 188.5062 210.0342 221.1105 240.1477 259.8764 276.3689 281.8339 302.2333 304.1905 323.5490 357.9501 365.3372 391.8653 413.1552 420.7241 429.7913 436.6020 441.5718 463.3011 474.9852 488.5798 513.3573 533.0669 544.1480 567.6427 582.1807 585.4056 595.1503 611.7657 630.8640 634.9279 637.8206 660.0944 668.8273 701.9218 709.9823 727.6751 729.9813 733.5057 762.1294 770.3644 776.3346 780.0349 785.3011 786.0475 809.6071 844.2123 855.4507 869.4507 873.8461 875.2119 882.6989 884.1512 890.6120 901.0421 914.9121 938.2906 944.5830 954.1801 956.4167 959.2844 974.5437 983.7352 985.1976 989.7031 1000.7137 1009.9003 1013.7451 1019.6092 1021.1536 1024.1474 1026.7952 1027.6851 1031.8046 1040.9486 1043.8607 1044.8599 1054.2785 1062.6995 1066.0307 1067.5315 1073.9789 1089.3534 1103.2363 1108.6112 1120.4459 1127.0435 1129.1714 1133.0567 1137.9922 1150.0975 1179.6093 1192.7076 1197.0204 1198.6517 1205.3299 1209.5379 1217.5364 1222.1179 1225.6972 1228.7997 1230.0038 1232.6403 1243.0933 1258.9328 1273.0859 1277.2645 1280.9673 1292.2280 1299.3291 1304.3248 1330.8039 1332.9976 1341.0756 1347.2142 1348.6443 1351.6740 1359.4961 1361.6808 1368.3328 1374.8081 1377.5360 1378.9509 1380.6252 1387.9323 1393.6021 1398.7290 1405.4480 1412.7286 1418.8318 1422.2261 1439.7748 1446.8995 1481.3844 1481.6900 1490.9292 1505.7645 1506.7994 1508.2025 1511.2079 1512.6677 1513.1746 1514.2487 1530.8832 1535.7409 1549.2267 1552.3945 1666.5000 1667.3835 1671.8304 1681.7103 1684.4033 1686.1741 1747.5422 1784.1336 3075.6239 3086.3764 3103.6670 3108.1849 3109.8219 3112.5735 3119.1264 3123.5247 3128.8195 3132.7245 3143.8460 3149.9287 3174.0365 3176.4479 3179.9523 3181.7982 3209.6031 3209.8502 3210.1313 3211.5858 3215.2435 3217.5795 3223.0339 3223.3724 3227.0621 3231.0150 3231.4699 3239.5778 3240.1264 3241.3507 3248.2052 3249.4008 3277.9313 3443.5929 3476.7014
redmass: 5.3820 5.5316 5.8259 4.6365 3.8512 4.4571 4.3059 3.5149 4.0830 3.1305 3.3902 3.4538 4.2784 4.4800 4.6884 3.6766 3.4462 2.9809 3.9888 4.4948 2.6139 4.2395 3.4056 1.9882 4.0264 4.7215 4.0417 4.8165 3.4269 3.4439 3.9604 3.0077 2.9547 5.8597 2.9583 2.8822 3.8755 3.3683 3.5222 4.6649 3.4660 4.2521 3.5088 3.5379 2.5230 4.1930 5.1204 6.3773 5.3819 3.9467 3.2531 4.3384 3.8932 1.6810 2.5852 1.8382 3.3790 2.9074 2.7604 2.7523 2.5965 1.4386 2.6292 1.6785 2.0478 3.0078 1.7215 1.7880 1.4329 1.9930 2.1875 1.8650 1.5918 2.2046 2.2005 1.8535 1.9569 1.4325 1.4902 2.5069 1.6985 1.5551 2.9043 2.9105 1.4373 1.9883 2.7971 4.9034 2.6595 1.3810 3.6991 1.3306 1.5442 1.7420 2.4915 2.6167 2.0953 2.2297 2.0805 2.0028 1.3617 2.3315 1.7639 1.6487 1.5839 1.8620 1.6883 2.1091 2.2516 1.1500 1.1137 1.1134 1.6965 2.2787 1.5341 2.1926 1.1407 1.6476 1.1538 1.5703 1.8880 1.8794 1.5181 1.4867 1.3036 1.3875 1.2757 1.5371 1.6593 2.2540 1.8839 1.3955 1.5431 1.9887 2.1796 1.4882 1.9635 1.7017 1.6789 1.3792 1.9470 1.3176 1.8198 1.3023 1.3624 1.3814 3.8529 1.2494 1.3559 1.3579 1.0875 1.2623 1.1064 1.5887 1.3401 1.4200 1.0942 1.5759 2.0243 1.1341 1.1053 3.0737 2.2379 2.2470 5.6681 5.7003 6.8917 6.9448 5.7060 5.6649 5.8121 11.4940 1.0695 1.0642 1.0678 1.0871 1.0638 1.0609 1.0888 1.0865 1.0866 1.0644 1.0603 1.1019 1.0979 1.1017 1.1100 1.1045 1.0923 1.0956 1.0903 1.0900 1.1092 1.0897 1.1063 1.0882 1.0904 1.0903 1.0911 1.0954 1.0948 1.0971 1.0995 1.0993 1.0946 1.0787 1.0771
irintensity: 0.8131 0.3894 3.6993 1.4227 0.4424 1.7418 1.1213 0.1227 0.8491 2.0541 0.7887 0.4117 0.9485 0.1141 2.2239 1.0845 10.0118 2.9572 5.0723 2.3840 4.0343 7.0430 7.6238 0.6081 6.4551 0.6475 1.0790 10.9189 0.4894 8.8318 1.5823 0.1064 0.1623 1.2193 3.1548 4.6146 10.2947 26.9003 3.4914 2.2025 9.2122 23.9558 5.6493 27.5606 9.4306 0.5031 10.9555 0.2581 10.7722 1.1023 17.0578 0.1194 4.0697 48.7597 70.9038 125.3596 4.7641 4.6955 5.0895 0.4700 11.0368 118.3059 22.0553 2.3081 9.0213 4.6282 9.7846 22.5336 6.0092 4.3631 2.5884 9.4681 7.8199 21.2416 7.7142 1.4543 4.3711 14.7035 13.9493 50.7802 6.0645 11.2059 45.6680 14.4244 2.8582 2.1837 14.7616 5.7403 1.8517 1.2345 1.5978 0.0511 15.0479 21.3934 10.3904 11.2711 5.3337 11.6614 4.1380 19.0371 36.2755 1.0550 6.4448 9.6820 6.0974 15.9223 21.7365 2.3321 78.0259 3.6655 0.0882 0.3277 48.0048 14.4977 1.8035 8.7377 1.5518 2.6832 1.3652 14.5803 18.1567 24.5327 3.3955 10.3149 4.6064 5.0414 2.7175 11.9993 10.2354 12.9123 33.7407 8.5005 50.7803 14.0284 10.1316 13.1592 69.8082 7.5292 4.7279 0.8310 18.4702 8.5024 18.2768 2.0702 7.3167 40.6169 623.5703 51.3464 37.5897 39.5312 16.8544 53.5582 8.6927 7.2837 41.5651 35.5740 14.0583 11.4432 41.0423 16.4565 11.5839 188.9281 7.4281 7.3643 4.0587 0.7700 3.3030 55.6000 0.9728 0.7466 536.4556 565.3948 5.5374 36.6848 10.5899 10.0444 21.1276 20.3595 23.1723 1.2298 5.8690 6.2238 8.6277 30.8762 10.6368 2.7597 12.9778 9.3458 7.8363 1.0046 4.4346 3.7045 4.2494 7.7905 2.2855 2.1487 5.8841 3.4999 4.1599 13.0571 9.3336 11.5397 6.1302 5.5214 1.1501 288.9262 112.2535
temp: 298.150 k
press: 1.00000 atm
elementType: 6 6 6 6 6 6 6 6 1 1 1 1 7 1 6 8 6 1 1 6 1 1 6 1 6 1 1 6 1 7 1 6 6 6 6 6 6 1 1 1 1 1 6 1 6 1 6 6 6 6 1 6 1 6 1 1 1 6 6 6 1 1 6 1 1 1 1 1 1 7 1
symmnumber: 1
zpe: 1630649.8 jmol-1
zpe.correction: 0.621082 hartree
zpe.thermalcorrener: 0.650429 hartree
zpe.thermalcorrenthalpy: 0.651373 hartree
zpe.thermalcorrgfe: 0.558276 hartree
zpe.sumelectzpe: -1478.614158 hartree
zpe.sumelectthermal: -1478.584811 hartree
zpe.sumelectthermalent: -1478.583867 hartree
zpe.sumelectthermalfe: -1478.676963 hartree
dipole: -46.8948 -26.8577 3.2452
dipole: 54.1386
quadrupole: 75.8855 -77.1921 -169.4366
quadrupole: 104.0230 -30.6042 -9.9126
quadrupole: 132.7999 -20.2777 -112.5222 104.0230 -30.6042 -9.9126
hfenergy: -1479.2352397 hartree
pointgroup: C01 [X(C32H35N3O1)]
dipole: -7.893466 -1.6735111 -1.1390128 debye
polarizability: 473.1361851|34.6735685|470.1059261|23.5577498|-23.7377032|418.5188701 unknown
InChI: InChI=1/32C.3N.O.35H
charge 2 multiplicity 1
71 atoms
C  0.40182411 -1.76532751 -0.12850833
C  -0.67991737 -2.04671755 -0.97125319
C  -1.22536059 -1.05960721 -1.7795877
C  -0.69134272 0.23016892 -1.71540893
C  0.37006393 0.50530637 -0.8558187
C  0.93739922 -0.48631641 -0.04964707
C  -0.12530724 -4.02810299 0.32260443
C  -1.03695747 -3.50766847 -0.85806335
H  -2.04131356 -1.2848093 -2.46081961
H  -1.10457729 1.01653406 -2.33761629
H  0.77431215 1.5111539 -0.81053769
H  1.77233316 -0.27420346 0.60398362
N  0.83952917 -2.94558033 0.51362351
H  -0.60919325 -4.28743287 1.26785017
C  2.16081545 -3.24254311 0.79364854
O  2.99951385 -2.37002029 0.95656897
C  2.46250397 -4.7257454 0.78138297
H  3.54362955 -4.84173073 0.86061649
H  2.00667409 -5.21202007 1.65242774
C  1.91225528 -5.34284873 -0.5199742
H  2.19866137 -6.39474569 -0.57971515
H  2.37169172 -4.83703021 -1.37569773
C  0.3890809 -5.18398764 -0.55810474
H  -0.10556071 -6.11295075 -0.26335231
C  -0.31238415 -4.54161798 -1.78615879
H  0.3715909 -4.02913532 -2.46520511
H  -0.9668675 -5.19334369 -2.36743626
C  -2.44933197 -3.79291457 -0.55719342
H  -2.83555773 -4.80772233 -0.64209112
N  -3.24502189 -2.88892148 -0.10746854
H  -2.86574426 -1.9406887 -0.00996788
C  -3.91690737 0.27347484 0.15924756
C  -4.64408908 -0.61533509 0.95763544
C  -4.63468101 -0.44845025 2.34771203
C  -3.90129437 0.58255788 2.92370806
C  -3.15734489 1.44860441 2.1224334
C  -3.16604792 1.29365753 0.73985091
H  -3.93653283 0.17723886 -0.92345121
H  -5.19285087 -1.11574872 2.99721558
H  -3.90618817 0.70514999 4.00125178
H  -2.57910176 2.24575036 2.57693105
H  -2.59623518 1.96589925 0.10802199
C  -5.36661179 -1.7581886 0.27558705
H  -5.46334634 -1.52476872 -0.78887956
C  -4.61048952 -3.12569025 0.3887698
H  -5.07386259 -3.83130683 -0.30493585
C  -4.5847635 -3.74781044 1.77323705
C  -5.53566238 -4.72222466 2.0899236
C  -3.63454634 -3.37915589 2.73141047
C  -5.56598239 -5.28985202 3.36237929
H  -6.23741869 -5.06959105 1.33674992
C  -3.65930889 -3.95571508 3.99682416
H  -2.8714775 -2.64224908 2.50211631
C  -4.63060992 -4.90329832 4.31824463
H  -6.30828008 -6.04524638 3.59579846
H  -2.91785324 -3.66342998 4.73248012
H  -4.64747988 -5.34962589 5.30663808
C  -7.53929001 -0.60800244 0.88473992
C  -7.64703905 -2.8504301 -0.08726312
C  -8.98823706 -1.0140777 0.69479167
H  -7.18876395 0.03319701 0.07368693
H  -7.30484838 -0.14404306 1.84001119
C  -8.89829889 -2.04329153 -0.43080196
H  -7.87726535 -3.72579181 0.51838456
H  -7.07805726 -3.15589286 -0.96396144
H  -9.3887885 -1.46019895 1.61037832
H  -9.6036634 -0.15161152 0.43689003
H  -9.77228909 -2.69219617 -0.49226242
H  -8.77454142 -1.54301305 -1.39470979
N  -6.7775947 -1.92211366 0.77006913
H  -6.73078492 -2.33266788 1.707843
