program: Gaussian 16
title: Title Card Required
version: ES64L-G16RevC.02
method: UwB97XD TD-FC
basis: 6-31+G(d,p)
operation: Freq
keyword: #P
keyword: Geom=AllCheck
keyword: Guess=TCheck
keyword: SCRF=Check
keyword: GenChk
keyword: UwB97XDTD(FC,Read)/6-31+G(d,p)
keyword: Freq
converged: YES YES NO YES
polarizability: 6.68672155e+02 5.60301218e+01 5.06989261e+02 1.09486039e+02 -3.84535603e+01 4.99454172e+02
1716.lowfreq: -269.2908 -6.3144 -0.0011 0.0004 0.0005 2.0878 6.1429 13.7024 19.1483
frequency: -269.1424 12.9765 17.5823 21.7624 25.5347 30.7509 36.9751 39.4391 53.6716 55.0940 61.0024 76.8771 80.7304 92.8655 99.4465 114.3869 122.3210 130.5471 162.7402 182.3316 200.1466 211.9680 215.9152 232.9747 258.7456 266.2217 277.7735 284.1961 286.1975 308.9150 342.9984 350.0355 406.2026 409.3176 420.6458 421.7241 434.9565 436.1760 441.0466 461.2710 484.0549 513.4153 532.3643 538.4008 552.3223 564.8567 582.7050 595.5590 604.8176 609.2138 613.0364 634.1839 635.2330 639.7767 652.3173 665.1834 695.3411 705.0597 731.2330 732.1394 740.7014 743.8563 755.1116 766.2931 776.8113 782.2557 789.9422 801.2443 818.0841 843.5900 864.1551 875.2768 881.6014 885.3069 892.7505 894.8285 896.9055 907.2826 943.8198 952.8250 967.9895 968.5498 971.7384 980.4702 985.5327 993.2620 997.3995 1016.2904 1023.4132 1024.5497 1026.7715 1030.2032 1033.0235 1038.5861 1040.0793 1041.5891 1043.5225 1045.9514 1048.8065 1062.0087 1065.9503 1068.0659 1075.7392 1083.5768 1105.4657 1117.1805 1126.8580 1134.6093 1137.2579 1153.1785 1163.9955 1191.1658 1195.0969 1196.4658 1200.4293 1212.9664 1218.9897 1221.4930 1223.8240 1227.1305 1229.1176 1250.7671 1257.1134 1265.0414 1273.2783 1280.6489 1293.4009 1302.0404 1313.8392 1329.7521 1331.2208 1340.0841 1344.7354 1351.3908 1354.3839 1363.2969 1369.4705 1374.3095 1377.0737 1379.6138 1380.5488 1387.5242 1398.8889 1402.9635 1409.1261 1415.9365 1427.1403 1437.5408 1459.9743 1473.6333 1490.8532 1497.5511 1503.7160 1504.7599 1505.0758 1507.5914 1509.7869 1512.7005 1528.8680 1536.7952 1545.1631 1548.6374 1552.8677 1636.6031 1666.4108 1667.1035 1673.3114 1684.5984 1686.7209 1728.3982 1733.1251 1796.6105 3079.0210 3100.7465 3106.4209 3107.0906 3112.9623 3120.8081 3132.1186 3134.0228 3139.9584 3162.0554 3172.4475 3174.0319 3174.8826 3177.9434 3201.7358 3208.2469 3213.1059 3216.4338 3220.8764 3222.1746 3228.4218 3229.2457 3236.7028 3237.4650 3238.7557 3245.4184 3246.5763 3251.0973 3252.9305 3259.1142 3262.9068 3297.7053 3337.0205 3469.7751 3597.3129
redmass: 4.5991 4.9705 5.1357 4.2357 4.8039 4.3928 3.5141 3.6077 3.6681 4.2862 4.3301 3.9315 3.5103 3.3084 4.1094 4.4892 4.1238 4.6710 4.2806 3.7816 3.9333 4.1587 4.7481 4.2884 4.3560 3.3295 3.3777 1.8687 3.4010 3.6271 6.1179 4.7656 3.7365 2.2771 3.9699 3.1411 2.9805 2.4868 2.9088 3.9782 3.5184 2.0206 3.0629 2.9612 4.7104 3.7770 2.6023 2.5004 3.5530 2.8641 1.6214 5.1499 6.0363 2.7863 1.8866 3.1832 2.7968 4.1695 1.6670 1.7734 1.7282 2.5986 3.3523 3.7539 4.3133 1.8907 1.7128 2.6734 3.3977 1.6771 2.1927 2.7696 1.3422 1.9467 2.7124 2.1538 1.4143 1.3612 2.0267 1.9568 1.4509 1.3410 1.5202 1.6902 1.4555 1.7067 2.0392 1.5311 4.9471 3.9926 3.3849 1.4288 2.6348 1.2861 1.3305 1.3961 2.4753 1.3217 2.0341 2.8443 2.4535 2.4205 2.1417 1.9299 3.1365 1.8143 1.5735 1.6782 1.7954 2.0348 2.2585 1.6607 1.1160 1.1163 1.8380 1.6214 1.8038 1.1845 1.4238 1.1926 1.5708 1.4460 2.0360 1.6433 1.4026 1.2838 1.3462 1.6843 1.6931 1.4901 1.4888 1.9363 1.4496 1.9609 1.7006 1.6627 2.2639 1.9047 1.5602 1.8435 1.5227 1.4651 1.2621 1.4029 1.3304 1.3088 2.1497 1.4698 1.1698 1.2619 2.1930 1.1388 1.3738 1.2587 1.4253 1.2232 1.6312 1.1260 1.1071 1.9954 3.3792 2.2575 2.2515 5.5497 5.7350 5.6822 7.0745 5.7844 5.6865 5.5820 5.3582 11.7213 1.0607 1.0679 1.0658 1.0834 1.0645 1.0876 1.0633 1.1016 1.0610 1.0633 1.1019 1.0901 1.1044 1.1042 1.0908 1.0995 1.1001 1.1081 1.0882 1.0875 1.0910 1.0908 1.0954 1.0952 1.0903 1.0995 1.0995 1.0912 1.0892 1.1167 1.0971 1.0955 1.0922 1.0774 1.0774
irintensity: 1.7623 0.7263 0.2154 1.2821 1.0205 1.8872 0.1030 0.5469 1.0057 4.9932 1.1110 3.7124 0.9780 1.5684 2.5888 0.1815 1.2535 1.8705 1.9508 15.4772 8.9262 5.0018 1.5828 2.6840 6.7269 2.4057 7.6119 0.5550 3.9191 3.0039 4.8210 3.7823 2.9221 1.1942 13.5634 1.9068 0.9563 2.1570 12.4676 20.2132 241.3155 343.0983 50.3528 41.7702 48.7202 2.8505 62.4478 33.8090 1.6676 394.0505 8.3943 1.2889 4.2266 42.0076 70.3987 28.5241 84.5749 0.2763 152.2120 88.3655 92.5291 3.3501 54.1780 23.1822 19.3841 3.0720 50.4497 54.7344 25.6405 2.6537 5.2390 40.4414 4.0226 9.3587 103.8495 24.6195 17.6736 14.4725 20.4861 1.5718 8.6884 102.5817 59.5053 15.0454 7.8784 14.2724 6.7792 4.9929 3.0117 6.7359 5.1463 2.1183 9.5820 19.4705 4.0784 2.0976 48.6135 5.3765 48.5244 17.6225 158.2540 323.4947 107.9442 122.0207 37.6922 20.8259 9.7568 30.2125 20.6274 17.2751 618.7402 346.0540 0.5514 3.2547 526.0534 20.2330 23.7965 5.9618 35.9050 5.8427 20.4809 27.3077 71.5270 36.1158 6.9201 6.6092 78.1578 112.5452 490.1523 194.3630 156.0098 47.4922 3.4295 110.8493 12.4439 51.8742 33.6864 75.9009 12.9640 19.1114 133.2791 120.0000 9.0805 28.1186 88.2982 100.8166 635.5624 16.7845 5.8173 97.2098 527.5547 26.9298 22.2022 19.9382 17.0395 279.4429 7.4096 13.9279 10.9830 422.6510 44.0835 8.3375 7.8185 16.1092 23.8273 9.8935 853.9735 4.8012 1.9569 160.9430 59.8520 921.5320 32.3368 14.5359 24.7594 16.1518 10.1469 8.1563 6.1531 12.1292 7.6901 19.4944 3.6981 6.6023 13.3006 11.1877 7.4195 6.9282 6.1235 2.6151 9.5300 0.1285 3.8626 6.8620 23.6085 9.0930 3.2253 10.3123 6.8612 4.7111 97.3157 13.4029 7.6813 13.3323 123.3340 127.7145 389.8949
temp: 298.150 k
press: 1.00000 atm
elementType: 6 6 6 6 6 6 6 6 1 1 1 1 7 1 6 8 6 1 1 6 1 1 6 1 6 1 1 6 1 7 1 6 6 6 6 6 6 1 1 1 1 1 6 1 6 1 6 6 6 6 1 6 1 6 1 1 1 6 6 6 1 1 6 1 1 1 1 1 1 7 1
symmnumber: 1
zpe: 1607757.9 jmol-1
zpe.correction: 0.612363 hartree
zpe.thermalcorrener: 0.643970 hartree
zpe.thermalcorrenthalpy: 0.644914 hartree
zpe.thermalcorrgfe: 0.544829 hartree
zpe.sumelectzpe: -1478.532182 hartree
zpe.sumelectthermal: -1478.500575 hartree
zpe.sumelectthermalent: -1478.499631 hartree
zpe.sumelectthermalfe: -1478.599716 hartree
hfenergy: -1479.2132448 hartree
pointgroup: C01 [X(C32H35N3O1)]
dipole: -3.7984533 -0.0018065 -3.9251423 debye
polarizability: 668.6721553|56.0301218|506.9892612|109.4860389|-38.4535603|499.4541724 unknown
InChI: InChI=1/32C.3N.O.35H
charge 2 multiplicity 1
71 atoms
C  0.80650276 -1.95339059 -0.59695042
C  -0.2185888 -1.84725476 -1.58006439
C  -0.14519803 -0.8446096 -2.57141455
C  0.89929252 0.05650917 -2.5295827
C  1.87441647 -0.0493496 -1.52528423
C  1.85333798 -1.0521794 -0.54981461
C  -0.649628 -3.6334736 -0.20551313
C  -1.15180464 -2.89564206 -1.36259285
H  -0.8724739 -0.79026609 -3.37209087
H  0.97776182 0.83678856 -3.27672228
H  2.69013274 0.66556868 -1.50854125
H  2.62522941 -1.12092827 0.20141935
N  0.54844396 -3.08191303 0.20935222
H  -1.12433307 -4.46003533 0.29344896
C  1.44432657 -3.62830424 1.14416723
O  2.43985056 -3.00509622 1.45726718
C  1.15835934 -5.01765737 1.65773561
H  1.67189818 -5.09021028 2.61742129
H  0.09473384 -5.18895016 1.83986707
C  1.73213496 -6.08850406 0.69509928
H  1.705016 -7.04315477 1.22992924
H  2.78409621 -5.85810766 0.49793092
C  0.97658525 -6.22261096 -0.59804664
H  -0.01637032 -6.66773217 -0.52968523
C  1.43984911 -5.84680204 -1.79132236
H  2.42824552 -5.40633895 -1.90258103
H  0.85033534 -5.97641619 -2.69393217
C  -2.32883826 -3.2274965 -2.05986286
H  -2.78236089 -4.2009698 -1.9229844
N  -2.97759969 -2.35106736 -2.87408303
H  -2.78790653 -1.35987432 -2.77158553
C  -3.09927715 0.34791085 -4.77945583
C  -4.28213455 -0.28227892 -4.37943085
C  -5.24456474 0.45556923 -3.68141156
C  -5.01768066 1.79412389 -3.3779202
C  -3.8254346 2.4084232 -3.75915425
C  -2.86647026 1.68455668 -4.46278828
H  -2.35977448 -0.20491181 -5.35346373
H  -6.17850108 -0.00081127 -3.3688329
H  -5.77366795 2.35660792 -2.84089517
H  -3.65068418 3.45121341 -3.51707092
H  -1.94328914 2.15926294 -4.77739698
C  -4.45204881 -1.75247967 -4.69926242
H  -3.69572939 -2.03489802 -5.43644919
C  -4.26189037 -2.69189228 -3.46359949
H  -4.16534892 -3.71436771 -3.84120872
C  -5.40175512 -2.67284705 -2.45288573
C  -6.42280642 -3.62153218 -2.56341083
C  -5.44945102 -1.74194692 -1.41067987
C  -7.49959013 -3.61233458 -1.67826838
H  -6.36676553 -4.39738176 -3.32198981
C  -6.5191627 -1.73836622 -0.52100084
H  -4.65273013 -1.01615047 -1.28317175
C  -7.55174682 -2.66563931 -0.65895601
H  -8.28361883 -4.35531666 -1.77719973
H  -6.5447168 -1.01104754 0.28349672
H  -8.38440614 -2.659586 0.03625802
C  -6.13812629 -1.02819662 -6.44932428
C  -5.8616884 -3.41997858 -6.02027495
C  -6.97378531 -1.82885747 -7.43028281
H  -5.20222232 -0.69330693 -6.90075762
H  -6.63971176 -0.18023816 -5.9880007
C  -6.23166565 -3.1633468 -7.47929447
H  -6.64039374 -3.97258411 -5.49637804
H  -4.90951286 -3.93309383 -5.89489561
H  -7.99491712 -1.95648105 -7.05823531
H  -7.02217238 -1.3296054 -8.39866044
H  -6.83614545 -3.98017503 -7.87473932
H  -5.33044057 -3.07607773 -8.09214276
N  -5.77273921 -2.03590311 -5.36811742
H  -6.49850543 -1.99283497 -4.64553942
