program: Gaussian 09
title: 000049783
version: EM64L-G09RevD.01
frameworkgroup: C1[X(C10H7I3N2O4)]
method: RPBEPBE
basis: SDD
operation: Freq
keyword: #p
keyword: freq=noraman
keyword: PBEPBE/SDD
title: #p freq=noraman PBEPBE/SDD
converged: YES YES NO NO
title: Mulliken charges:
elementType: I I I O O O O N N C C C C C C C C C C H H H H H H H
charge: 0.177552 0.167737 0.192812 -0.369383 -0.198574 -0.172141 -0.218526 -0.499274 -0.570145 0.788525 0.527981 0.674320 -0.674388 -0.724656 -0.745743 0.051067 -0.023803 0.225139 -0.767798 0.324961 0.220542 0.263746 0.261472 0.348697 0.346426 0.393452
chargesum: 0.00000
title: Mulliken charges with hydrogens summed into heavy atoms:
elementType: I I I O O O O N N C C C C C C C C C C
charge: 0.177552 0.167737 0.192812 0.024069 -0.198574 -0.172141 -0.218526 -0.174313 0.124977 0.788525 0.527981 0.674320 -0.674388 -0.724656 -0.745743 0.051067 -0.023803 0.225139 -0.022037
polarizability: 2.78225570e+02 -1.66838502e+00 2.58789049e+02 1.95493058e+00 -2.73996417e+00 1.15631885e+02
1716.lowfreq: -0.0005 -0.0004 -0.0004 0.9967 4.8800 6.4605 30.7775 34.9750 47.1773
frequency: 30.7525 34.9574 47.1754 51.3877 55.7865 62.6360 72.9188 87.0532 90.7477 93.8328 100.6097 123.7132 127.3539 144.5907 161.6766 184.9393 200.8642 212.1746 279.6425 293.3776 323.6341 407.2077 415.2469 418.5367 432.1703 488.7324 516.9304 533.7436 541.1258 576.3351 591.7367 600.3189 619.2297 628.0955 635.5771 678.6785 693.3327 722.7144 756.5620 779.0563 861.1700 914.6769 961.9005 998.6060 1023.1264 1038.0639 1061.1154 1064.5339 1213.3829 1231.4940 1268.0708 1312.0615 1341.3694 1355.6355 1361.0269 1385.0594 1435.1435 1455.2932 1467.3412 1523.4979 1529.1862 1592.8990 1637.8597 1642.2901 1652.8929 2992.7707 3081.7044 3123.9770 3500.3542 3510.3814 3523.9807 3664.8980
redmass: 7.5547 9.5902 9.4710 8.1725 10.0455 5.6232 2.7819 7.0444 1.2840 40.9307 16.1545 9.3960 7.7713 8.9916 92.1120 7.4559 15.9612 7.8412 5.8236 4.8776 7.5434 5.7973 6.4839 6.9175 4.8972 1.7381 1.5120 1.7781 2.8685 2.3657 2.9046 2.4466 1.6048 4.2245 4.1956 9.0983 5.3258 6.8073 9.8293 10.4204 8.7300 4.2243 4.5738 2.7227 5.7948 1.6626 2.7834 1.8724 3.1406 2.4556 3.6720 9.4376 6.4510 6.3968 6.6304 1.2292 1.5754 1.2423 1.0670 9.1606 11.2775 1.5350 3.3160 7.0137 10.0608 1.0376 1.0985 1.0989 1.0639 1.0451 1.0770 1.1047
irintensity: 1.9682 2.1374 1.0244 1.7519 1.8784 8.8424 5.8556 5.3313 2.0120 0.8297 2.9399 0.1951 0.0399 0.3380 0.0717 6.5685 1.5247 2.0380 2.2674 2.4496 1.6093 5.6445 1.4331 11.7043 16.8725 20.1785 20.3593 109.3457 51.7765 33.7656 29.5936 119.2337 49.8241 17.0204 24.4218 6.7762 14.2782 44.5926 7.3788 10.4452 23.0339 11.5166 38.8715 51.2601 2.3525 20.0176 263.7963 11.3707 105.6829 27.0629 146.9801 7.3698 19.4282 60.4277 208.2510 82.5643 241.2918 76.2887 21.0380 89.4174 44.5871 57.8102 206.1248 182.7600 261.9084 7.8946 12.7674 7.8367 41.1283 59.0025 25.3270 32.1659
temp: 298.150 k
press: 1.00000 atm
elementType: 53 53 53 8 8 8 8 7 7 6 6 6 6 6 6 6 6 6 6 1 1 1 1 1 1 1
symmnumber: 1
zpe: 415947.1 jmol-1
zpe.correction: 0.158426 hartree
zpe.thermalcorrener: 0.179591 hartree
zpe.thermalcorrenthalpy: 0.180535 hartree
zpe.thermalcorrgfe: 0.102931 hartree
zpe.sumelectzpe: -828.822178 hartree
zpe.sumelectthermal: -828.801013 hartree
zpe.sumelectthermalent: -828.800069 hartree
zpe.sumelectthermalfe: -828.877673 hartree
dipole: -2.3000 1.7240 2.0686
dipole: 3.5414
quadrupole: -132.7018 -140.8635 -162.1147
quadrupole: -2.6562 20.1095 -8.5571
quadrupole: 12.5249 4.3632 -16.8880 -2.6562 20.1095 -8.5571
hfenergy: -828.980604 hartree
pointgroup: C01 [X(C10H7I3N2O4)]
dipole: 1.1200208 0.4914671 -0.6672748 debye
dipolederiv: -0.0967558 0.2558177 -0.0828292 0.2783233 -0.3015782 0.0695803 -0.0644792 0.0877657 0.046504 -0.1267792 -0.259904 -0.0485194 -0.236069 -0.3282103 -0.0329221 -0.0473681 -0.0510845 0.0493103 -0.4982715 0.0196549 -0.1047327 -0.0004233 0.0296606 -0.0076418 -0.1452095 -0.0123046 0.0511317 -0.3609019 0.0193682 -0.1167862 0.0345132 -0.534038 0.3824329 -0.1349737 0.4051788 -1.016487 -0.5120989 -0.1818956 0.2521229 -0.252473 -0.6526625 0.1638514 0.1009645 -0.0620681 -0.8105842 -0.4755229 0.2055326 0.2001876 0.2641534 -0.6796056 -0.2166193 0.0649117 0.0231841 -0.7770555 -0.6031794 -0.0206219 -0.1259919 0.1242839 -0.3499421 -0.1979226 0.30145 -0.1859887 -0.8675143 -1.3376403 0.1592022 0.3503472 0.2254664 -0.4500131 0.0032393 0.4950603 -0.0539552 -0.5663745 -0.4861959 0.0776958 -0.1135007 0.0950185 -0.544742 -0.3370634 -0.086735 -0.2942094 -0.9809183 0.6323407 -0.088978 -0.1456629 0.0996671 -0.4520668 -0.0425938 0.1115071 -0.0244481 0.0684038 -0.6197838 0.1374473 -0.1369639 0.13472 -0.4559365 0.061966 -0.1649525 0.0454658 -0.00551 -0.5722693 -0.0458641 -0.1338039 -0.1093509 -0.4575538 -0.0236364 -0.1242761 -0.0441374 0.0063027 0.340501 -0.3766306 0.2167726 -0.5026172 0.7668029 -0.204698 0.0232766 -0.1883734 -0.1080024 0.2584496 0.3974582 0.162166 0.4579782 0.7904142 0.0888677 0.1481035 0.0966305 -0.1470139 1.067105 -0.062411 0.2470083 -0.0518441 0.1929833 -0.0067203 0.2802989 -0.0011794 -0.1288534 0.5500733 0.3021911 -0.2427805 0.3681057 0.980789 0.2113342 -0.0965318 0.3958624 1.4820967 0.6505098 -0.3938171 -0.1016689 -0.4598527 1.1639027 -0.1210424 0.0135853 -0.3315123 1.5140132 1.5493889 -0.1195187 -0.1686717 -0.5539378 0.2801594 0.3948749 -0.7220968 0.3315422 1.20795 -0.4490305 0.0104621 -0.0867045 0.1252083 0.0502088 0.0318006 -0.1188066 0.0122036 -0.0252348 0.1046238 -0.0159859 -0.0007037 0.0645658 0.2515416 -0.1058849 -0.0349782 -0.0579346 0.2087929 0.0752306 0.0215553 0.0090235 -0.0552421 -0.0037866 -0.1309034 -0.0397864 -0.112679 -0.0193028 0.0398203 -0.0210887 0.0468347 -0.0642639 0.1097751 0.0164359 0.101417 0.03077 -0.0082635 0.0804158 -0.0049376 -0.0142318 0.0471664 -0.0406214 0.0598559 -0.0442088 0.0472753 0.0905321 0.2456749 -0.0722548 0.0472051 -0.0584681 0.2064711 -0.0013859 0.0691572 0.057953 0.2325855 0.2800661 -0.0420403 0.0565783 -0.0576172 0.2179686 0.0044989 0.0433522 -0.0021694 0.1949585 0.2642297 0.099563 0.0353057 0.0829891 0.2100797 -0.0597035 0.0713183 -0.1117872 0.308533 unknown
polarizability: 274.6137758|-2.7145673|258.8595162|23.6889257|3.1543868|119.1732126 unknown
InChI: InChI=1S/C10H7I3N2O4/c1-2(16)15-8-6(12)3(9(14)17)5(11)4(7(8)13)10(18)19/h15,18H,14H2,1H3
charge 0 multiplicity 1
26 atoms
I  1.413236 -2.992933 0.709957
I  1.396106 3.159316 0.575722
I  -3.803049 0.043853 -0.507161
O  -1.879458 3.07778 -1.243061
O  -2.358412 -3.028753 0.862936
O  -2.308251 3.173598 1.042868
O  3.100698 -0.727981 -1.404694
N  2.498068 0.108381 0.692254
N  -1.675218 -3.054721 -1.364658
C  1.093723 0.080772 0.46397
C  -0.997644 -1.174848 0.03043
C  -1.037535 1.292669 0.109404
C  0.38627 -1.147254 0.333403
C  0.354449 1.290837 0.360461
C  -1.69629 0.052449 -0.076978
C  -1.739958 -2.502862 -0.10313
C  -1.805398 2.591359 0.06153
C  3.442237 -0.295721 -0.272111
C  4.88959 -0.205249 0.192081
H  2.839125 0.578469 1.534269
H  5.048528 0.544754 0.986758
H  5.527727 0.036362 -0.671666
H  5.203438 -1.192284 0.579717
H  -1.14169 -2.616013 -2.11461
H  -2.137546 -3.948393 -1.535196
H  -2.395546 3.930714 -1.253095
