program: Gaussian 16
title: Title Card Required
version: ES64L-G16RevC.02
method: UwB97XD
basis: 6-31+G(d,p)
operation: Freq
keyword: #P
keyword: Geom=AllCheck
keyword: Guess=TCheck
keyword: SCRF=Check
keyword: GenChk
keyword: UwB97XD/6-31+G(d,p)
keyword: Freq
converged: YES YES NO YES
polarizability: 5.98199484e+02 5.07350151e+01 5.24456646e+02 9.30561793e+01 7.21070941e+00 4.31285914e+02
1716.lowfreq: -3.6049 -0.0006 0.0007 0.0008 4.3258 6.8924 13.8721 16.8921 21.6217
frequency: 13.7209 15.9378 21.2845 31.8727 36.1494 39.8756 51.3209 62.3568 66.2554 71.2187 82.0839 103.6583 105.2422 111.1924 121.5273 122.1344 145.6117 150.8209 178.8984 196.0023 215.3681 233.0600 238.8164 257.8801 272.8421 282.3193 287.0376 305.8430 312.3836 336.8759 359.8586 387.4126 411.9333 420.7528 431.2415 435.1468 441.1961 464.7810 470.2585 489.2659 515.9089 522.7995 536.9420 544.6858 550.6508 564.8609 582.6837 597.0170 601.5256 615.5273 633.2637 634.8757 649.8466 661.7261 669.4172 702.8885 714.3808 731.7176 740.5373 751.9452 765.1727 772.6776 775.4965 784.1676 798.5609 802.8725 816.5938 832.5906 844.8089 850.6042 875.6072 882.4872 885.0790 885.3390 893.9972 895.9423 944.8604 949.1943 953.0634 967.7611 973.2737 978.6737 980.4446 985.0274 988.2885 1010.9241 1017.3391 1023.1092 1023.6132 1025.7987 1029.6117 1034.4355 1035.1422 1041.0556 1046.2947 1047.8829 1058.0643 1062.2309 1066.4715 1073.0303 1084.6122 1099.1935 1110.4225 1120.7038 1127.1364 1128.3597 1134.6007 1149.0846 1161.9295 1192.3468 1195.5069 1197.3134 1201.2572 1213.2487 1214.5900 1221.4974 1224.2446 1226.6483 1229.8686 1233.9606 1245.9822 1262.6211 1270.7809 1274.8157 1276.5423 1284.1507 1297.5366 1300.6514 1326.9261 1333.1014 1345.6203 1347.2818 1355.4329 1356.7822 1366.8251 1372.0053 1372.6283 1376.1473 1379.0832 1383.0039 1386.3687 1391.0860 1396.0038 1400.9896 1406.8166 1410.0275 1415.6385 1434.8257 1457.1575 1471.4531 1474.6022 1481.8122 1489.8392 1504.1029 1505.6580 1506.2066 1507.2146 1509.4445 1513.0156 1522.1821 1527.7013 1549.3708 1551.7270 1563.4643 1623.4439 1663.5218 1666.0927 1666.9773 1684.7718 1685.9837 1703.4599 1808.6859 3051.4021 3078.3802 3096.7981 3102.6435 3103.5294 3108.9682 3114.5444 3129.5453 3134.4668 3145.3269 3155.7172 3174.4698 3174.6307 3175.3471 3179.8884 3207.7767 3209.6621 3216.1902 3217.7388 3220.2485 3220.8504 3224.0526 3229.5353 3231.7621 3233.0852 3238.6830 3239.1001 3240.7444 3247.4629 3247.7280 3252.1084 3290.5244 3292.9333 3472.3175 3623.1311
redmass: 4.9781 5.1497 5.5304 4.0367 3.7598 3.7170 3.2863 4.2287 4.5593 3.6220 3.6574 3.4578 3.4930 4.2283 1.3810 2.0290 3.8913 3.3825 4.0344 3.1715 4.6461 5.2873 2.9866 4.3592 4.3415 1.8636 4.0517 3.9385 3.8117 3.3182 3.6483 3.4891 5.4585 2.9729 2.9711 3.0258 3.0425 4.1533 2.7643 3.4215 2.0585 2.9889 3.3213 3.5869 3.8438 3.9989 2.5687 3.2486 3.6907 4.2490 6.0720 6.3652 3.9309 2.8777 2.4784 4.2973 4.3408 1.7123 1.6253 3.0690 2.5937 2.0124 2.5769 2.1414 3.7743 2.7814 3.6826 3.1935 1.7804 1.8238 2.6417 1.3995 1.7826 1.4559 1.4911 2.1196 2.0921 2.5848 1.9624 1.4355 1.3735 1.8017 2.3591 1.5210 1.3452 2.2547 1.5820 5.7288 3.3211 2.9775 1.4408 1.3849 2.5923 1.3328 3.0609 1.3276 2.2909 2.7569 2.1958 2.1449 1.9335 2.2765 2.2919 2.1892 1.9127 1.8427 1.6912 2.5953 1.8724 1.6649 1.1169 1.1230 2.0077 1.6991 1.5339 2.0805 1.1393 1.1434 1.5325 1.3664 1.4992 2.1234 1.6238 1.3581 1.4746 1.2887 1.2728 1.9031 1.4250 1.6902 1.4057 2.1065 1.3721 2.0342 1.6535 1.9731 1.5033 1.6374 1.5081 1.4139 1.4648 1.4679 1.2946 2.2102 1.3896 1.4556 1.3168 3.2111 1.6125 1.3471 1.1958 1.1127 2.3270 1.1237 1.2958 2.1412 1.0906 1.4719 1.1369 2.4025 1.1087 2.2410 2.2664 3.9994 5.9261 5.8231 5.6541 5.7236 5.7184 5.7095 4.4787 11.8788 1.0835 1.0690 1.0808 1.0677 1.0678 1.0637 1.0859 1.0865 1.0643 1.0604 1.1046 1.1016 1.0980 1.0513 1.1046 1.0906 1.0912 1.1086 1.0923 1.0927 1.1034 1.0875 1.0905 1.0909 1.0883 1.0951 1.0952 1.0912 1.0995 1.0995 1.0975 1.1198 1.0948 1.0771 1.0765
irintensity: 0.4103 0.5334 2.0852 0.5956 0.7956 0.2003 0.1912 2.0391 0.5774 2.3235 0.2656 2.2008 2.0915 0.5293 2.1959 1.4984 1.5906 6.1399 5.3427 2.8011 0.6041 3.2901 2.5306 6.4920 1.7840 1.0730 6.3771 5.8557 3.6354 7.0231 0.7107 11.4702 0.9611 1.3076 1.5715 0.4383 5.3715 8.1430 11.3681 21.8777 45.5848 18.4904 12.0652 7.1024 30.8021 17.5515 11.0249 26.3305 5.0986 3.5529 0.6178 0.9008 19.7309 106.0258 35.7495 1.4014 59.5191 118.9991 120.3764 4.2321 49.0769 54.3560 2.4891 8.1918 14.7302 28.0083 9.8467 18.4649 3.5676 9.8693 14.8000 3.4427 8.0133 4.6986 1.3448 2.8840 18.3926 31.2520 11.6420 0.1208 35.9220 11.2718 2.1675 2.2206 3.6973 24.3899 4.8040 4.1576 21.4049 15.4466 1.8413 1.2551 1.4262 0.2475 50.6218 3.5590 23.7588 15.3712 5.5471 7.3895 20.4034 7.5398 14.1805 46.5238 70.8140 127.0682 35.7869 168.2785 119.3551 189.9094 0.0286 0.1862 7.2319 157.1229 10.4785 13.7141 2.6560 1.9584 20.3356 44.3368 41.8465 13.4866 21.1963 6.0933 3.0719 5.4801 8.6067 455.0595 186.7074 44.1584 1.0234 1.2404 1.3623 3.6179 288.3200 8.2432 3.1948 1.7400 206.9182 135.2004 27.3109 39.0918 7.1946 44.7296 3.9286 45.1430 36.1594 588.6704 142.8976 144.7834 0.9436 14.1886 136.1411 23.9797 32.4229 46.3421 5.6813 7.7853 11.9114 918.7693 4.6401 7.3703 12.9889 57.7876 134.3044 183.3886 4.1405 2.5035 0.3177 1.4418 894.7762 642.5611 3.9843 7.5640 13.9251 13.2106 31.7781 22.6172 16.7501 7.2473 5.9852 8.4689 16.9479 3.1997 8.0128 7.2086 11.0763 3.7238 8.3405 4.1723 2.7712 6.9671 3.5254 1.0692 3.7618 5.5089 1.0266 16.8940 11.7544 3.4829 7.8028 5.4560 5.7800 5.1753 5.4381 128.0659 334.0042
temp: 298.150 k
press: 1.00000 atm
elementType: 6 6 6 6 6 6 6 6 1 1 1 1 7 1 6 8 6 1 1 6 1 1 6 1 6 1 1 6 1 7 1 6 6 6 6 6 6 1 1 1 1 1 6 1 6 1 6 6 6 6 1 6 1 6 1 1 1 6 6 6 1 1 6 1 1 1 1 1 1 7 1
symmnumber: 1
zpe: 1615781.7 jmol-1
zpe.correction: 0.615419 hartree
zpe.thermalcorrener: 0.646657 hartree
zpe.thermalcorrenthalpy: 0.647601 hartree
zpe.thermalcorrgfe: 0.548483 hartree
zpe.sumelectzpe: -1478.563372 hartree
zpe.sumelectthermal: -1478.532134 hartree
zpe.sumelectthermalent: -1478.531190 hartree
zpe.sumelectthermalfe: -1478.630308 hartree
dipole: -37.0458 -23.3824 -34.5254
dipole: 55.7775
quadrupole: 0.3745 -87.8659 -29.5822
quadrupole: 89.9294 162.7526 76.0063
quadrupole: 39.3990 -48.8414 9.4423 89.9294 162.7526 76.0063
hfenergy: -1479.1787911 hartree
pointgroup: C01 [X(C32H35N3O1)]
dipole: -4.5493865 -0.9838124 -4.225612 debye
polarizability: 598.1994844|50.7350151|524.4566461|93.0561793|7.2107094|431.2859143 unknown
InChI: InChI=1/32C.3N.O.35H
charge 2 multiplicity 3
71 atoms
C  0.7650853 -1.90000685 -0.2933097
C  -0.37737258 -1.69739209 -1.12743449
C  -0.61830986 -0.40894792 -1.65833279
C  0.26155721 0.60827553 -1.36828791
C  1.38989458 0.37761039 -0.54780971
C  1.65768784 -0.8635893 0.00064521
C  -0.32035988 -3.96736171 -0.42647018
C  -1.0651443 -2.93465352 -1.22856291
H  -1.47407304 -0.18453106 -2.28390495
H  0.08831834 1.60037067 -1.76921763
H  2.06335954 1.20147381 -0.33763986
H  2.51622579 -1.03691996 0.63322306
N  0.8013422 -3.21030023 0.12162797
H  -0.95156391 -4.32988335 0.39669124
C  1.78851487 -3.85358698 0.86592311
O  2.74435476 -3.25562419 1.3211615
C  1.5171029 -5.32761937 1.02510745
H  2.39706492 -5.78146136 1.48070364
H  0.68990521 -5.43538118 1.73752256
C  1.16848697 -6.01495608 -0.31010599
H  0.72095845 -6.98644913 -0.09177111
H  2.09500127 -6.21175873 -0.85530328
C  0.21745764 -5.19078608 -1.23027611
H  -0.65726171 -5.79876711 -1.48171138
C  0.88766523 -4.75295761 -2.49167499
H  1.89438893 -4.34701282 -2.46324097
H  0.35790715 -4.7587567 -3.43752052
C  -2.23090074 -3.28066609 -1.9080737
H  -2.62427558 -4.28710273 -1.79252109
N  -2.92393073 -2.48166764 -2.70782776
H  -2.61147206 -1.52878616 -2.84916221
C  -2.830885 -0.02532702 -4.83079941
C  -4.07481575 -0.54470251 -4.45618976
C  -5.02833417 0.30870731 -3.88961113
C  -4.73554717 1.65429689 -3.69403128
C  -3.486127 2.16070698 -4.05086569
C  -2.53417902 1.32039388 -4.62166469
H  -2.0889427 -0.67261017 -5.29150962
H  -6.00477078 -0.06241614 -3.59366479
H  -5.48416816 2.30693215 -3.25830158
H  -3.26050365 3.20972394 -3.89199161
H  -1.5642559 1.70835263 -4.91372473
C  -4.31082159 -2.02968403 -4.63604683
H  -3.54468128 -2.42417705 -5.30897427
C  -4.20948705 -2.8356888 -3.29733053
H  -4.16036711 -3.89855086 -3.55059786
C  -5.36352428 -2.6269138 -2.32942453
C  -6.45627282 -3.49767227 -2.37781137
C  -5.35856131 -1.58989856 -1.39179047
C  -7.54968173 -3.30854785 -1.53425805
H  -6.44623042 -4.35116154 -3.05034346
C  -6.4459255 -1.40733432 -0.5434315
H  -4.50725192 -0.9212881 -1.31443156
C  -7.54791972 -2.25837775 -0.62012609
H  -8.39025997 -3.99237174 -1.58170066
H  -6.43101003 -0.59951372 0.180406
H  -8.39419946 -2.11268801 0.04259171
C  -5.88895491 -1.41727838 -6.5207187
C  -5.7533987 -3.76098106 -5.82870551
C  -6.71787769 -2.28100688 -7.45257632
H  -4.91989903 -1.17048997 -6.95851674
H  -6.37023476 -0.50552956 -6.17362255
C  -6.04255121 -3.64515277 -7.32333219
H  -6.58328141 -4.21485846 -5.28838739
H  -4.83684935 -4.30389979 -5.60346808
H  -7.76000569 -2.32115189 -7.12165517
H  -6.69617313 -1.88729388 -8.46934896
H  -6.66846847 -4.47141279 -7.66162465
H  -5.11060251 -3.66469577 -7.89472931
N  -5.6181867 -2.32028488 -5.32335252
H  -6.36812664 -2.1655199 -4.64214465
