program: Gaussian 09
title: 000049725
version: EM64L-G09RevD.01
frameworkgroup: C1[X(C18H14O2)]
method: RPBEPBE
basis: SDD
operation: Freq
keyword: #pfreq=noraman
keyword: PBEPBE/SDD
title: #p freq=noraman PBEPBE/SDD
converged: YES YES NO NO
title: Mulliken charges:
elementType: O O C C C C C C C C C C C C C C C C C C H H H H H H H H H H H H H H
charge: -0.441453 -0.437472 0.296410 -0.310796 0.405482 -0.187131 0.232975 0.453266 -0.678031 -0.613808 0.198145 -0.380463 -0.231496 0.421943 -0.494504 -0.476256 -0.368085 -0.431436 -0.258736 -0.247537 0.237361 0.262755 0.252353 0.231366 0.236018 0.236591 0.242755 0.237459 0.224822 0.344456 0.241307 0.340933 0.229551 0.231259
chargesum: 0.00000
title: Mulliken charges with hydrogens summed into heavy atoms:
elementType: O O C C C C C C C C C C C C C C C C C C
charge: -0.096998 -0.096539 0.296410 -0.073435 0.405482 0.075625 0.232975 0.453266 -0.425678 -0.382442 0.198145 -0.144444 0.005094 0.421943 -0.251749 -0.238797 -0.143263 -0.190130 -0.029185 -0.016278
polarizability: 3.77954340e+02 -2.01477328e+00 2.04776081e+02 -2.50823396e+00 7.59677924e+00 9.81489858e+01
1716.lowfreq: -12.5915 -4.1213 -0.0004 0.0001 0.0004 5.4541 43.7955 53.7178 83.5976
frequency: 43.7684 53.7000 83.5926 136.7353 138.4654 150.3684 197.9873 226.4557 236.2982 248.5441 296.9942 315.4079 343.9559 345.2760 370.0770 403.6792 433.4213 441.3466 477.0691 492.5798 522.9469 529.5260 539.5697 559.5352 584.9319 612.3954 638.8755 693.4208 716.7507 739.5149 753.4817 758.7229 770.9727 791.5540 807.0202 832.5272 857.0964 872.2541 881.1755 886.6990 912.5026 918.5520 937.2236 953.4914 959.0503 968.1638 980.3237 983.4586 993.5095 1037.2591 1055.8058 1102.3942 1147.5769 1161.8112 1164.6617 1178.0642 1183.7920 1205.1497 1214.4654 1231.5840 1236.4212 1266.2779 1272.1560 1286.5083 1301.4129 1330.1242 1338.3180 1347.7345 1379.8304 1394.6179 1407.3969 1410.7665 1432.4307 1446.4440 1469.3348 1508.8060 1515.1113 1568.9294 1609.2222 1623.1098 1626.9953 1635.6697 2986.3890 3071.6702 3106.9800 3112.5127 3120.1127 3123.2353 3132.7948 3138.7349 3144.8809 3151.9758 3154.4637 3166.6179 3540.4932 3560.0715
redmass: 5.9619 4.9563 4.9832 4.6462 5.5312 5.0412 4.7003 2.6356 3.0199 1.6038 3.9887 1.1494 3.7190 5.2421 5.2465 3.1385 3.1146 4.8349 5.4235 4.5222 6.6100 3.4515 3.8607 3.7232 3.8002 6.2122 6.0517 3.8743 5.8810 2.7713 5.4054 1.2960 3.1619 2.2572 2.2089 1.4733 3.3805 3.5038 4.1335 1.7017 1.7309 1.9959 4.2635 4.0530 1.4289 4.2100 1.3285 1.3898 1.3709 2.2968 2.3143 2.1444 1.6822 1.1490 1.4210 1.0872 1.1600 1.2515 1.5060 1.8857 1.9347 2.0804 1.3553 1.5353 1.8044 2.1658 1.6959 1.1830 2.3497 3.4967 2.5946 2.8202 3.0058 3.4848 3.3488 3.8404 4.0983 7.2399 6.0413 6.6594 6.9001 7.0017 1.0850 1.0854 1.0911 1.0875 1.0863 1.0865 1.0890 1.0903 1.0982 1.0931 1.0974 1.0998 1.0664 1.0665
irintensity: 0.5214 0.3488 2.7238 1.2744 0.4831 0.2824 3.7479 29.4576 13.2793 98.5736 1.0716 85.3293 13.6680 25.4867 3.9027 0.7826 14.1591 1.1852 0.6591 5.7323 0.1904 3.9431 0.0962 7.1598 5.2016 4.7168 4.1565 14.5447 1.5450 2.4034 4.5379 48.0401 16.1497 9.3078 0.8361 31.4421 86.4159 34.5777 9.5486 0.5673 60.7775 27.9560 46.3231 53.1868 12.4748 14.7760 1.8771 0.0850 0.0383 6.2561 10.9296 9.6282 6.4336 8.8041 7.1467 0.9690 52.3553 36.7380 2.4253 1.6402 23.3467 2.5068 10.1820 0.5142 3.2210 25.2266 4.8543 55.8978 14.0906 3.4597 0.4671 5.4510 2.7298 2.9485 4.8301 15.1937 3.4975 0.5649 5.7115 1.6375 0.6969 0.1749 39.8247 14.0243 12.7048 7.3665 1.5943 2.9256 8.0152 1.1018 29.6626 31.7133 26.5367 35.1330 12.4571 7.3646
temp: 298.150 k
press: 1.00000 atm
elementType: 8 8 6 6 6 6 6 6 6 6 6 6 6 6 6 6 6 6 6 6 1 1 1 1 1 1 1 1 1 1 1 1 1 1
symmnumber: 1
zpe: 699768.0 jmol-1
zpe.correction: 0.266528 hartree
zpe.thermalcorrener: 0.282175 hartree
zpe.thermalcorrenthalpy: 0.283119 hartree
zpe.thermalcorrgfe: 0.223963 hartree
zpe.sumelectzpe: -843.395006 hartree
zpe.sumelectthermal: -843.379359 hartree
zpe.sumelectthermalent: -843.378414 hartree
zpe.sumelectthermalfe: -843.437571 hartree
dipole: -3.8147 -0.2743 0.0464
dipole: 3.8248
quadrupole: -123.5457 -98.5649 -123.1632
quadrupole: -2.9523 -1.3162 -0.6576
quadrupole: -8.4545 16.5264 -8.0719 -2.9523 -1.3162 -0.6576
hfenergy: -843.6615337 hartree
pointgroup: C01 [X(C18H14O2)]
dipole: 1.5001839 0.1172675 0.0104799 debye
polarizability: 377.9857522|-0.9519007|204.2973909|1.6888346|-10.3121475|98.5962641 unknown
InChI: InChI=1S/C18H14O2/c19-17-8-7-13-9-15-12(10-16(13)18(17)20)6-5-11-3-1-2-4-14(11)15/h1-10,17-20H
charge 0 multiplicity 1
34 atoms
O  -3.789892 -1.081464 -1.641926
O  -4.681247 0.123078 1.715246
C  -1.963978 -0.559227 -0.064275
C  -3.440626 -0.885505 -0.206696
C  -1.529885 0.808222 -0.181492
C  -4.387219 0.241382 0.261781
C  0.838332 0.083635 -0.036889
C  0.391859 -1.280989 0.115847
C  -1.00996 -1.566198 0.100321
C  -0.153462 1.099871 -0.172894
C  2.276554 0.367944 -0.030456
C  -2.541112 1.872923 -0.25099
C  -3.871174 1.627862 -0.056415
C  3.20769 -0.723414 0.135061
C  1.357652 -2.341377 0.27963
C  2.71356 -2.072968 0.289772
C  2.808553 1.685597 -0.183384
C  4.613029 -0.461033 0.144307
C  4.190208 1.921256 -0.171927
C  5.103798 0.840666 -0.006248
H  -3.691604 -1.803909 0.361894
H  -5.36267 0.060383 -0.21828
H  -1.334082 -2.609256 0.216876
H  0.148943 2.149079 -0.259918
H  -2.188217 2.897187 -0.426984
H  -4.60152 2.44407 -0.066634
H  0.992044 -3.368334 0.396177
H  3.441157 -2.883425 0.414992
H  2.133598 2.536728 -0.315352
H  -3.066122 -1.605201 -2.071275
H  5.305001 -1.302104 0.271571
H  -3.920601 0.514892 2.217917
H  4.570085 2.941702 -0.291753
H  6.18231 1.031328 0.001993
