program: Gaussian 16
title: Title Card Required
version: ES64L-G16RevC.02
basis: 6-31+G(d,p)
method: UwB97XD TD-FC
operation: Freq
keyword: #p
keyword: td=(nstates=30,root=2)
keyword: uwb97xd/6-31+g(d,p)
keyword: freq=projected
keyword: scrf=(CPCM,solvent=chloroform)
keyword: nosymm
keyword: scf=xqc
keyword: Guess=mix
keyword: density=current
title: #p td=(nstates=30,root=2) uwb97xd/6-31+g(d,p) freq=projected scrf=(CPC
basis: NPDir=0 NMtPBC= 1 NCelOv= 1 NCel= 1 NClECP= 1 NCelD= 1
basis: NCelK= 1 NCelE2= 1 NClLst= 1 CellRange= 0.0.
basis: One-electron integrals computed using PRISM.
basis: NBasis= 859 RedAO= T EigKep= 1.08D-06 NBF= 859
basis: NBsUse= 855 1.00D-06 EigRej= 5.76D-07 NBFU= 855
converged: NO NO NO NO
polarizability: 5.69888412e+02 5.85466150e+01 4.83281823e+02 9.29210092e+00 9.36014979e+01 6.00730591e+02
1716.lowfreq: -89.5100 -15.1091 -0.0006 -0.0003 0.0010 4.0094 10.7216 12.7013 17.2507
frequency: -83.4069 11.0662 15.4120 19.1865 23.7193 35.1698 44.8525 51.8034 56.0075 58.6035 59.8536 77.6779 92.3727 98.2755 104.2511 104.8862 120.9773 157.4415 173.4855 184.1482 202.8102 212.5777 241.2067 253.5356 257.8578 277.1343 282.2809 285.5424 308.3935 312.3207 321.0251 348.1342 396.1942 417.2749 420.1678 421.8980 431.8529 437.5368 443.5194 462.0582 487.8218 499.4316 536.2066 542.4871 552.1139 569.9598 582.3329 590.4594 602.3183 612.1172 627.1104 635.5364 637.1398 656.4942 665.2111 687.4973 706.0057 726.0831 728.7475 731.7326 733.4639 747.2042 752.7246 770.2707 781.0286 785.3318 788.4341 809.3874 820.3706 847.0461 864.4440 876.5012 878.0206 880.7517 885.3976 888.1455 897.3737 904.5240 943.4877 951.3041 962.6236 973.0374 973.5455 975.7708 980.6974 983.3286 996.5862 1013.6859 1014.3069 1019.3877 1024.3481 1025.3781 1026.1758 1030.4718 1031.4255 1037.5680 1039.9916 1041.4156 1041.7080 1061.7484 1066.3030 1075.1048 1078.9213 1103.0053 1118.6467 1125.9787 1130.9751 1133.0144 1151.9097 1163.6905 1179.0756 1195.1311 1195.4926 1197.3214 1212.8256 1218.1681 1221.8947 1223.6674 1225.3719 1229.3920 1243.9463 1252.9806 1261.2400 1276.9924 1281.5237 1284.1135 1292.6621 1301.2133 1310.8602 1330.6032 1333.5275 1343.5193 1345.7547 1353.0001 1358.2781 1369.1278 1372.4923 1373.4858 1376.9866 1381.2508 1388.5404 1392.8658 1399.6647 1407.4662 1409.1013 1415.5816 1454.1415 1460.7559 1468.7480 1474.5277 1494.2168 1498.6957 1501.6569 1504.2527 1505.2124 1509.0501 1514.2820 1516.6623 1523.1182 1527.8270 1549.6511 1551.8497 1568.0759 1608.5640 1666.6025 1667.3544 1670.6257 1686.4036 1687.4351 1728.8380 1786.6190 3078.9694 3100.6342 3105.6405 3106.9004 3116.6735 3125.5563 3133.2304 3135.3088 3141.0752 3162.9092 3172.8231 3173.5127 3177.2774 3177.9945 3207.2472 3207.6323 3213.5730 3214.3604 3218.1099 3219.0227 3226.7383 3227.6841 3233.9973 3235.4116 3240.2348 3244.7554 3245.2297 3246.7280 3253.4806 3261.5379 3264.6511 3301.7385 3326.6920 3471.7361 3593.5708
redmass: 4.8708 4.9714 5.2839 5.2731 5.6996 4.1032 3.0947 4.7511 4.0068 3.8860 4.3107 3.5177 3.2335 3.5487 4.0827 3.3933 4.1550 3.9646 4.3750 4.3111 4.1218 4.2877 4.6790 4.7900 4.4109 3.4433 2.1674 2.7065 3.1378 3.2340 4.1054 4.4302 2.4569 3.8565 3.5024 3.4733 2.9748 2.3170 3.0414 4.0008 3.2932 3.6518 3.3424 2.3408 4.9307 3.2992 2.8200 2.4832 3.4651 3.0352 3.2594 6.0601 6.2683 1.7938 2.9084 1.6233 3.7117 2.2298 1.9203 2.1801 1.5824 2.7399 2.5181 2.6610 1.9559 2.1705 2.3734 2.8721 3.5523 1.7183 2.2224 1.9043 1.4155 1.5744 1.9496 1.3004 2.6662 2.6612 1.8817 2.0320 1.4838 1.3697 1.5468 1.4898 1.6954 1.4000 2.5291 1.4762 1.4158 1.6613 3.7118 3.3195 2.9631 2.9247 2.9765 1.3984 1.4743 1.4273 1.7579 2.8977 2.2031 2.1086 1.7575 2.1681 1.8597 1.5857 1.9379 1.7072 1.9408 2.7325 1.6384 1.1243 1.1458 1.5991 1.5718 1.5883 1.4421 1.1942 1.1892 1.7730 2.0425 1.4214 2.1109 1.3859 1.3121 1.9283 1.5102 1.6199 1.6082 1.2340 1.9482 1.3671 2.1646 1.8264 1.5409 1.8838 1.6528 1.6412 1.5491 1.4865 1.4108 1.2340 1.8531 1.4047 1.3243 1.3925 1.9163 1.1706 1.9542 1.3838 1.1377 1.1837 1.0944 1.3665 1.7418 1.5968 1.1776 2.2857 2.5887 1.1151 2.2388 2.2828 5.2277 2.8332 5.7201 5.7382 7.4936 5.7533 5.7669 4.6594 11.8111 1.0606 1.0678 1.0848 1.0644 1.0641 1.0875 1.0629 1.1015 1.0610 1.0641 1.1015 1.0889 1.1058 1.1043 1.0937 1.0898 1.1052 1.1085 1.0878 1.0886 1.0909 1.0910 1.0954 1.0952 1.0884 1.0993 1.0994 1.0903 1.0919 1.1166 1.0970 1.0933 1.0942 1.0770 1.0792
irintensity: 1.4263 2.4756 0.3221 0.2327 3.2766 0.6162 0.8666 0.6997 1.0498 0.3434 2.3102 1.7065 1.4255 2.2188 0.4754 0.5884 2.1019 3.7297 0.3016 3.3887 2.2104 2.8254 2.9622 10.2776 3.4057 1.9058 2.1557 10.3454 46.2519 1.6506 3.7624 5.9672 12.7028 6.5218 2.1060 9.9245 0.9802 2.8798 3.0917 0.6575 14.1511 14.8006 13.0798 60.6556 0.1018 29.0420 8.4376 39.5051 17.5160 316.4166 1.2854 10.4260 0.4184 26.6968 19.8941 48.8262 12.7407 51.4272 50.1909 27.2878 159.3697 3.0474 59.8447 31.4635 12.4943 40.4365 50.1861 24.0832 12.8159 3.1248 5.7385 12.7070 14.1302 2.6288 7.6720 1.9331 10.2544 31.2126 18.1524 2.0818 0.2291 49.5556 22.0303 39.9600 5.7385 6.1486 18.5156 2.7912 1.2563 0.1779 20.1730 8.2053 15.5755 15.0320 11.8098 3.5525 10.9931 14.8151 47.4640 15.2215 8.6762 5.3475 14.0719 117.7523 4.8318 8.4317 38.3326 33.8125 15.0791 166.5567 28.6887 0.7331 3.7292 23.8927 1.1292 59.0775 75.4401 27.7105 25.8594 28.3676 24.8420 45.0712 117.6559 16.4472 20.1094 137.2332 121.6715 395.0201 100.4175 4.6324 105.5502 5.9529 18.8753 16.2387 128.0939 9.3639 18.3208 4.8955 171.2242 111.1934 136.8889 25.4796 65.3935 30.3927 7.7661 19.2129 27.7950 5.2050 172.0835 65.7174 17.2278 37.1774 14.2202 7.6300 39.7852 4.8516 31.0890 44.9382 48.6404 11.4388 6.5771 9.2555 57.5445 642.9073 11.6083 6.2326 215.2730 0.7180 0.5393 54.4224 418.3511 27.9731 13.4605 26.3757 21.5765 5.4794 9.7706 6.4071 8.8850 8.0451 19.2594 4.1927 13.2680 5.0275 11.9157 8.4746 8.7409 3.8929 3.3524 5.1077 2.9880 4.6280 3.5943 19.1484 14.6777 46.9361 11.9823 7.7823 0.4089 0.7182 13.7186 1.6485 38.2050 7.2738 132.7326 132.8653
temp: 298.150 k
press: 1.00000 atm
elementType: 6 6 6 6 6 6 6 6 1 1 1 1 7 1 6 8 6 1 1 6 1 1 6 1 6 1 1 6 1 7 1 6 6 6 6 6 6 1 1 1 1 1 6 1 6 1 6 6 6 6 1 6 1 6 1 1 1 6 6 6 1 1 6 1 1 1 1 1 1 7 1
symmnumber: 1
zpe: 1599695.5 jmol-1
zpe.correction: 0.609292 hartree
zpe.thermalcorrener: 0.640621 hartree
zpe.thermalcorrenthalpy: 0.641565 hartree
zpe.thermalcorrgfe: 0.542331 hartree
zpe.sumelectzpe: -1478.489204 hartree
zpe.sumelectthermal: -1478.457875 hartree
zpe.sumelectthermalent: -1478.456931 hartree
zpe.sumelectthermalfe: -1478.556165 hartree
hfenergy: -1479.2110539 hartree
pointgroup: C01 [X(C32H35N3O1)]
dipole: -3.7852307 -0.1957337 -0.4235112 debye
polarizability: 569.8884119|58.546615|483.2818231|9.2921009|93.6014979|600.7305915 unknown
InChI: InChI=1/32C.3N.O.35H
charge 2 multiplicity 1
71 atoms
C  -0.22581563 -3.13134664 0.9555614
C  -1.52633116 -3.56375913 0.55577096
C  -2.64098419 -3.29345714 1.37704607
C  -2.42956864 -2.68625946 2.61091772
C  -1.13773175 -2.31480701 3.00272561
C  -0.01261767 -2.52506302 2.18248579
C  -0.05043914 -4.1034529 -1.06632437
C  -1.40923849 -4.19201547 -0.72291256
H  -3.6426648 -3.53637261 1.04412355
H  -3.26820418 -2.48434134 3.2659258
H  -0.99264785 -1.83125288 3.96179894
H  0.97419421 -2.22817688 2.50485344
N  0.65549355 -3.43989549 -0.08134178
H  0.42656248 -4.45862505 -1.96407827
C  2.02331392 -3.04718019 -0.12620806
O  2.51263334 -2.52793252 0.85366851
C  2.77476767 -3.23279428 -1.41681492
H  3.82166501 -3.34889092 -1.13164304
H  2.47553456 -4.13518112 -1.95368066
C  2.63237917 -1.98157418 -2.32054082
H  3.3645239 -2.09083593 -3.12708314
H  2.9121956 -1.094723 -1.74313162
C  1.25867459 -1.81353949 -2.90666457
H  0.96326394 -2.54665392 -3.65778954
C  0.40607302 -0.84383587 -2.57232534
H  0.66925141 -0.08712015 -1.83667185
H  -0.57423682 -0.76851815 -3.03275472
C  -2.47415089 -4.71086195 -1.51319896
H  -2.41414667 -4.71208647 -2.59579211
N  -3.55618978 -5.30091314 -0.9374431
H  -3.46262542 -5.63194769 0.01695847
C  -5.73171961 -5.63975902 1.55266842
C  -5.74679842 -6.52826581 0.47331901
C  -5.61087708 -7.89924209 0.71752031
C  -5.44728652 -8.36692527 2.01764073
C  -5.40971469 -7.47212193 3.08622881
C  -5.55573637 -6.10699712 2.85318021
H  -5.87508963 -4.57660476 1.37879888
H  -5.63289107 -8.61485937 -0.09844571
H  -5.3465355 -9.43227397 2.1947597
H  -5.2777228 -7.84018977 4.09797058
H  -5.5455057 -5.40566099 3.6807771
C  -5.88573268 -5.95824883 -0.92126875
H  -6.19580871 -4.91326989 -0.83942676
C  -4.55466491 -5.97806089 -1.74104915
H  -4.70948422 -5.35655731 -2.62826164
C  -4.11085428 -7.35926262 -2.21079742
C  -4.52550457 -7.81786614 -3.46462793
C  -3.29144786 -8.17717685 -1.42672243
C  -4.16744684 -9.08906257 -3.91083955
H  -5.10279909 -7.1695632 -4.11875623
C  -2.92513418 -9.44227546 -1.87497036
H  -2.93089157 -7.83481197 -0.46177676
C  -3.36994248 -9.90499336 -3.11304589
H  -4.49779531 -9.42928422 -4.88642199
H  -2.28925148 -10.06725899 -1.25654179
H  -3.08218912 -10.89139648 -3.46043896
C  -8.26214598 -6.84880372 -0.88240871
C  -7.41531641 -5.87728878 -2.96119428
C  -9.38099821 -6.7409084 -1.90192041
H  -8.31168783 -6.04199074 -0.14885979
H  -8.19032649 -7.801757 -0.36269635
C  -8.90392733 -5.59192384 -2.78771303
H  -7.22809602 -6.53724641 -3.80749681
H  -6.80577284 -4.98096898 -3.06281517
H  -9.47698871 -7.66794327 -2.47548518
H  -10.33508006 -6.53990377 -1.41327097
H  -9.40650571 -5.5518223 -3.75466702
H  -9.05357592 -4.63343397 -2.28306639
N  -6.99272029 -6.63105699 -1.69637175
H  -6.64772463 -7.55079482 -1.98914152
