program: Gaussian 16
title: Title Card Required
version: ES64L-G16RevC.02
basis: 6-31+G(d,p)
method: UwB97XD TD-FC
operation: Force
keyword: #p
keyword: td=(nstates=30,root=3)
keyword: uwb97xd/6-31+g(d,p)
keyword: force
keyword: scrf=(CPCM,solvent=chloroform)
keyword: nosymm
keyword: scf=xqc
keyword: Guess=mix
keyword: density=current
title: #p td=(nstates=30,root=3) uwb97xd/6-31+g(d,p) force scrf=(CPCM,solvent
basis: NPDir=0 NMtPBC= 1 NCelOv= 1 NCel= 1 NClECP= 1 NCelD= 1
basis: NCelK= 1 NCelE2= 1 NClLst= 1 CellRange= 0.0.
basis: One-electron integrals computed using PRISM.
basis: NBasis= 859 RedAO= T EigKep= 1.02D-06 NBF= 859
basis: NBsUse= 855 1.00D-06 EigRej= 5.39D-07 NBFU= 855
converged: NO NO NO NO
hfenergy: -1479.2127463 hartree
pointgroup: C01 [X(C32H35N3O1)]
dipole: -4.6722092 -0.8759882 -0.8969478 debye
InChI: InChI=1/32C.3N.O.35H
charge 2 multiplicity 1
71 atoms
C  -0.22648392 -3.12377315 0.94454184
C  -1.51861495 -3.57542487 0.5447303
C  -2.64212113 -3.31337202 1.36984848
C  -2.43922199 -2.73130064 2.61337795
C  -1.15223652 -2.35864687 3.00662134
C  -0.02071095 -2.54040979 2.17614165
C  -0.02990806 -4.09835331 -1.07052423
C  -1.39307187 -4.21725134 -0.71977789
H  -3.64470548 -3.53698499 1.0223826
H  -3.28055526 -2.54120386 3.26764235
H  -1.00671565 -1.88888813 3.97310025
H  0.96295883 -2.23723278 2.50388982
N  0.66471927 -3.42159843 -0.09775287
H  0.44498885 -4.43178747 -1.97770592
C  2.02582653 -3.02582238 -0.13495331
O  2.51234909 -2.50369056 0.84862729
C  2.78491019 -3.21288961 -1.42230283
H  3.83153094 -3.3239203 -1.13465975
H  2.49207475 -4.11938292 -1.95663485
C  2.64284794 -1.96641415 -2.33246601
H  3.37789252 -2.07690384 -3.13597488
H  2.92045969 -1.07683191 -1.7580383
C  1.27190574 -1.7992511 -2.92521117
H  0.98366401 -2.52723765 -3.68394665
C  0.4138212 -0.83571923 -2.58796578
H  0.66874611 -0.08482909 -1.84322951
H  -0.56451938 -0.76077778 -3.05280614
C  -2.43271218 -4.80266937 -1.49283445
H  -2.30898337 -4.94846293 -2.55925724
N  -3.56756549 -5.29482297 -0.92605402
H  -3.55032918 -5.54755956 0.05562092
C  -5.74119479 -5.63391901 1.55694552
C  -5.75691802 -6.52046693 0.47560215
C  -5.61685146 -7.89186138 0.71706446
C  -5.44800763 -8.36149243 2.01540799
C  -5.40787196 -7.46848886 3.08564408
C  -5.55763224 -6.10341987 2.85586518
H  -5.8910703 -4.57092663 1.38685467
H  -5.63886349 -8.60624504 -0.09992811
H  -5.34523493 -9.42695379 2.19012383
H  -5.27163805 -7.83848656 4.09615626
H  -5.54548022 -5.40369123 3.68460054
C  -5.89749397 -5.94885783 -0.91819106
H  -6.21299032 -4.90543421 -0.83630031
C  -4.56448948 -5.96561606 -1.73537756
H  -4.71665738 -5.34262491 -2.6226484
C  -4.11865641 -7.3460805 -2.20553494
C  -4.52698037 -7.80617918 -3.46057931
C  -3.29694408 -8.15730195 -1.41800095
C  -4.16384405 -9.0778343 -3.90199354
H  -5.10262833 -7.15974788 -4.11771107
C  -2.92612903 -9.42214517 -1.8616529
H  -2.93988436 -7.80631024 -0.45490971
C  -3.3680726 -9.88996851 -3.09909129
H  -4.48956771 -9.420915 -4.87789997
H  -2.2895392 -10.04278729 -1.24024553
H  -3.07804395 -10.87719285 -3.44191577
C  -8.26745903 -6.85114263 -0.88424492
C  -7.42150393 -5.87743135 -2.96293777
C  -9.38606239 -6.74350695 -1.90416358
H  -8.31997458 -6.04644021 -0.14868333
H  -8.19327013 -7.8053167 -0.36708241
C  -8.91013673 -5.59331473 -2.78910204
H  -7.2344618 -6.54040773 -3.80701757
H  -6.81251334 -4.98115733 -3.068397
H  -9.48122837 -7.67029329 -2.47829326
H  -10.34014776 -6.54332199 -1.41512871
H  -9.41254016 -5.55323916 -3.75613943
H  -9.06077864 -4.6351359 -2.28400413
N  -6.99778883 -6.62727316 -1.69617886
H  -6.64644827 -7.54490421 -1.98753828
