program: Gaussian 16
title: Title Card Required
version: ES64L-G16RevC.02
basis: 6-31+G(d,p)
method: UwB97XD TD-FC
operation: Force
keyword: #p
keyword: td=(nstates=30,root=2)
keyword: uwb97xd/6-31+g(d,p)
keyword: force
keyword: scrf=(CPCM,solvent=chloroform)
keyword: nosymm
keyword: scf=xqc
keyword: Guess=mix
keyword: density=current
title: #p td=(nstates=30,root=2) uwb97xd/6-31+g(d,p) force scrf=(CPCM,solvent
basis: NPDir=0 NMtPBC= 1 NCelOv= 1 NCel= 1 NClECP= 1 NCelD= 1
basis: NCelK= 1 NCelE2= 1 NClLst= 1 CellRange= 0.0.
basis: One-electron integrals computed using PRISM.
basis: NBasis= 859 RedAO= T EigKep= 1.08D-06 NBF= 859
basis: NBsUse= 855 1.00D-06 EigRej= 5.76D-07 NBFU= 855
converged: NO NO NO NO
hfenergy: -1479.2110344 hartree
pointgroup: C01 [X(C32H35N3O1)]
dipole: -3.7864063 -0.1977149 -0.4196908 debye
InChI: InChI=1/32C.3N.O.35H
charge 2 multiplicity 1
71 atoms
C  -0.22562527 -3.1317738 0.95610252
C  -1.52602575 -3.56421156 0.55594544
C  -2.64107706 -3.29390746 1.37667531
C  -2.42967329 -2.68737791 2.6107511
C  -1.13791878 -2.31487341 3.00226856
C  -0.01291119 -2.52723655 2.18363509
C  -0.04987338 -4.10452036 -1.06563685
C  -1.40903319 -4.19261098 -0.72312525
H  -3.64240628 -3.53622059 1.04337211
H  -3.26811416 -2.48584296 3.26640829
H  -0.9928201 -1.83195311 3.96209064
H  0.97371233 -2.22829894 2.50436259
N  0.6559668 -3.44054073 -0.08132673
H  0.42757279 -4.46096039 -1.96317643
C  2.02294453 -3.04625434 -0.12664544
O  2.51211454 -2.52600274 0.85274049
C  2.77472716 -3.23157539 -1.41712992
H  3.82167186 -3.34806121 -1.13141967
H  2.47614059 -4.13475387 -1.95360377
C  2.63258599 -1.98109131 -2.32075119
H  3.36513882 -2.08978717 -3.12749292
H  2.91272003 -1.09422224 -1.74341465
C  1.25904872 -1.81320611 -2.90730745
H  0.96398846 -2.54635211 -3.65824089
C  0.40661625 -0.84329438 -2.57305765
H  0.66928686 -0.08700949 -1.83667674
H  -0.57370423 -0.76857131 -3.03357036
C  -2.47370368 -4.71115091 -1.51298189
H  -2.41340855 -4.71348497 -2.59573053
N  -3.5564514 -5.30025601 -0.93733092
H  -3.46217888 -5.63299534 0.016523
C  -5.73206773 -5.63957088 1.55290279
C  -5.74706834 -6.52794855 0.4734682
C  -5.61109467 -7.8988763 0.71761684
C  -5.44710279 -8.36674034 2.0175323
C  -5.40946432 -7.47192781 3.08627249
C  -5.5557626 -6.1068401 2.85327426
H  -5.87537879 -4.57641384 1.37900206
H  -5.63307941 -8.61446937 -0.09844925
H  -5.34674795 -9.43201515 2.19468861
H  -5.27739507 -7.84008594 4.09809646
H  -5.54606388 -5.40560442 3.68089857
C  -5.88591507 -5.95794344 -0.9212731
H  -6.19647823 -4.91295332 -0.83944436
C  -4.55490043 -5.97779545 -1.74120417
H  -4.71127897 -5.35722547 -2.6288695
C  -4.11042497 -7.35905345 -2.21064197
C  -4.52543683 -7.81764885 -3.46448012
C  -3.29126783 -8.17681492 -1.42624837
C  -4.1673256 -9.08890119 -3.91049893
H  -5.10288662 -7.16950414 -4.11818396
C  -2.92506416 -9.44199551 -1.87467462
H  -2.93120678 -7.83469286 -0.46128771
C  -3.36968812 -9.9047068 -3.11300297
H  -4.49793245 -9.42915768 -4.88595653
H  -2.28961955 -10.06696135 -1.25605374
H  -3.08164594 -10.89101125 -3.46015456
C  -8.26224553 -6.8489074 -0.88241824
C  -7.41555945 -5.87731509 -2.96119278
C  -9.38122277 -6.74097061 -1.90196444
H  -8.31190653 -6.04211918 -0.14875601
H  -8.19051519 -7.8018347 -0.36283531
C  -8.90420725 -5.59190193 -2.78778052
H  -7.22825805 -6.53726584 -3.8075039
H  -6.80607637 -4.98091257 -3.06281243
H  -9.47700766 -7.668033 -2.47571073
H  -10.33542469 -6.5400556 -1.41344711
H  -9.40669845 -5.55177675 -3.75478804
H  -9.05364332 -4.63336278 -2.28312394
N  -6.99292463 -6.63089186 -1.69631094
H  -6.64808139 -7.55064257 -1.98913832
