program: Gaussian 16
title: Title Card Required
version: ES64L-G16RevC.02
basis: 6-31+G(d,p)
method: UwB97XD TD-FC
operation: Force
keyword: #p
keyword: td=(nstates=30,root=3)
keyword: uwb97xd/6-31+g(d,p)
keyword: force
keyword: scrf=(CPCM,solvent=chloroform)
keyword: nosymm
keyword: scf=xqc
keyword: Guess=mix
keyword: density=current
title: #p td=(nstates=30,root=3) uwb97xd/6-31+g(d,p) force scrf=(CPCM,solvent
basis: NPDir=0 NMtPBC= 1 NCelOv= 1 NCel= 1 NClECP= 1 NCelD= 1
basis: NCelK= 1 NCelE2= 1 NClLst= 1 CellRange= 0.0.
basis: One-electron integrals computed using PRISM.
basis: NBasis= 859 RedAO= T EigKep= 1.03D-06 NBF= 859
basis: NBsUse= 855 1.00D-06 EigRej= 5.23D-07 NBFU= 855
converged: NO NO NO NO
hfenergy: -1479.2135106 hartree
pointgroup: C01 [X(C32H35N3O1)]
dipole: -3.8454717 -0.3762834 -0.6265311 debye
InChI: InChI=1/32C.3N.O.35H
charge 2 multiplicity 1
71 atoms
C  -0.22530361 -3.12904011 0.94755873
C  -1.51812059 -3.57314061 0.54358482
C  -2.64310106 -3.31876389 1.37522868
C  -2.44145684 -2.73625858 2.6176647
C  -1.1548478 -2.36072783 3.00782896
C  -0.02020358 -2.54496835 2.17433661
C  -0.03274881 -4.07709762 -1.07922262
C  -1.39132441 -4.21009585 -0.72582128
H  -3.64351328 -3.53357809 1.02234297
H  -3.28383742 -2.53955786 3.27012827
H  -1.00778842 -1.88810341 3.97113413
H  0.9613374 -2.23728182 2.5012647
N  0.66703287 -3.42269033 -0.09768006
H  0.44483975 -4.4300572 -1.97797628
C  2.02761461 -3.02569163 -0.1344511
O  2.51305319 -2.50379427 0.84817881
C  2.78533999 -3.21304313 -1.42262259
H  3.83215049 -3.32381371 -1.13507215
H  2.49264005 -4.1192819 -1.95728692
C  2.64296276 -1.96627395 -2.33270057
H  3.37791558 -2.07673718 -3.13635771
H  2.9203595 -1.07691049 -1.75803559
C  1.27241441 -1.79904559 -2.92590058
H  0.9838234 -2.52702827 -3.68425153
C  0.41382795 -0.83527263 -2.58836067
H  0.66867814 -0.08489779 -1.84331163
H  -0.56450076 -0.76073582 -3.05303897
C  -2.42007203 -4.82858959 -1.48899162
H  -2.30488142 -4.96591381 -2.55694342
N  -3.57001937 -5.28480513 -0.92498808
H  -3.55881072 -5.54506451 0.05412417
C  -5.74118294 -5.63388202 1.55692741
C  -5.7567577 -6.52037576 0.4755085
C  -5.61674332 -7.89179053 0.71697177
C  -5.44797569 -8.36142493 2.01536
C  -5.40786258 -7.46842148 3.08564205
C  -5.55762744 -6.10335796 2.85582891
H  -5.89113341 -4.57090741 1.38681872
H  -5.63888539 -8.60633024 -0.09990884
H  -5.3452569 -9.42692025 2.1901649
H  -5.27165451 -7.8384266 4.09617635
H  -5.54551809 -5.40364185 3.68460125
C  -5.89799443 -5.94815839 -0.91848322
H  -6.21472922 -4.9050698 -0.83586813
C  -4.56562437 -5.9618032 -1.73612223
H  -4.71955244 -5.34248994 -2.62584462
C  -4.11693918 -7.34289435 -2.20446326
C  -4.52600204 -7.80458375 -3.45915348
C  -3.29623458 -8.15585019 -1.41721224
C  -4.16404525 -9.07657822 -3.90088063
H  -5.10225679 -7.15947029 -4.11719721
C  -2.92618095 -9.42137444 -1.8613086
H  -2.93942466 -7.80651194 -0.45368078
C  -3.36806799 -9.88945083 -3.09857268
H  -4.48970043 -9.42015669 -4.876903
H  -2.28966537 -10.04259505 -1.24009431
H  -3.07814131 -10.87687281 -3.44170686
C  -8.26759263 -6.85121702 -0.88428287
C  -7.4216219 -5.87748241 -2.96302528
C  -9.38614751 -6.74355473 -1.90417564
H  -8.31998999 -6.04646292 -0.14869892
H  -8.19331062 -7.80539158 -0.36703632
C  -8.91022356 -5.59336961 -2.78911425
H  -7.23448331 -6.54045688 -3.80707496
H  -6.81261647 -4.98125274 -3.06838594
H  -9.48123899 -7.6703596 -2.47828654
H  -10.34019431 -6.54335578 -1.41513833
H  -9.41257069 -5.55330731 -3.75616467
H  -9.06077822 -4.6351756 -2.28403324
N  -6.99780128 -6.62722892 -1.6962142
H  -6.64649153 -7.54503102 -1.98752879
