program: Gaussian 16
title: Title Card Required
version: ES64L-G16RevC.02
basis: 6-31+G(d,p)
method: UwB97XD TD-FC
operation: Force
keyword: #p
keyword: td=(nstates=30,root=2)
keyword: uwb97xd/6-31+g(d,p)
keyword: force
keyword: scrf=(CPCM,solvent=chloroform)
keyword: nosymm
keyword: scf=xqc
keyword: Guess=mix
keyword: density=current
title: #p td=(nstates=30,root=2) uwb97xd/6-31+g(d,p) force scrf=(CPCM,solvent
basis: NPDir=0 NMtPBC= 1 NCelOv= 1 NCel= 1 NClECP= 1 NCelD= 1
basis: NCelK= 1 NCelE2= 1 NClLst= 1 CellRange= 0.0.
basis: One-electron integrals computed using PRISM.
basis: NBasis= 859 RedAO= T EigKep= 1.08D-06 NBF= 859
basis: NBsUse= 855 1.00D-06 EigRej= 5.76D-07 NBFU= 855
converged: NO NO NO NO
hfenergy: -1479.2108565 hartree
pointgroup: C01 [X(C32H35N3O1)]
dipole: -3.7849804 -0.2099409 -0.4118946 debye
InChI: InChI=1/32C.3N.O.35H
charge 2 multiplicity 1
71 atoms
C  -0.224936 -3.13312279 0.95609948
C  -1.52464139 -3.5648707 0.55500892
C  -2.64123476 -3.29617611 1.37435731
C  -2.43012442 -2.69248562 2.60968933
C  -1.13881307 -2.32068637 3.0028187
C  -0.012472 -2.52835477 2.18347063
C  -0.04538406 -4.11201848 -1.06297868
C  -1.40570474 -4.1970449 -0.72169087
H  -3.64244679 -3.53753459 1.03762255
H  -3.26939822 -2.49368436 3.26526612
H  -0.99427282 -1.84296731 3.9650055
H  0.97379079 -2.22757379 2.50472675
N  0.6575578 -3.44177576 -0.08030519
H  0.43507649 -4.47495479 -1.95623396
C  2.02241537 -3.04138447 -0.12748616
O  2.50820935 -2.51617144 0.85107022
C  2.7753595 -3.22873 -1.41795236
H  3.82219694 -3.34211431 -1.13185275
H  2.4794885 -4.13290613 -1.95486779
C  2.63449121 -1.97823054 -2.32300024
H  3.36765679 -2.08446278 -3.12890806
H  2.91507112 -1.09104083 -1.7473157
C  1.26229277 -1.81000447 -2.91103082
H  0.96828372 -2.54345078 -3.66213681
C  0.40884097 -0.841293 -2.57633118
H  0.66879513 -0.08668764 -1.83728467
H  -0.57093631 -0.76762228 -3.03782284
C  -2.47083182 -4.71535753 -1.51018367
H  -2.41099748 -4.72140569 -2.59225991
N  -3.55794567 -5.29843001 -0.93613628
H  -3.46413225 -5.63001742 0.01801857
C  -5.73442679 -5.63830014 1.55421915
C  -5.75023714 -6.52653102 0.47453273
C  -5.61253178 -7.89727186 0.71810301
C  -5.44658096 -8.3657175 2.01757595
C  -5.40824554 -7.47108252 3.08666256
C  -5.55593619 -6.10623434 2.85404225
H  -5.87862764 -4.57513689 1.38103381
H  -5.63463395 -8.61257864 -0.09836838
H  -5.3472761 -9.43119119 2.1940417
H  -5.27571858 -7.83977729 4.09807991
H  -5.54737265 -5.40525397 3.68204916
C  -5.88812449 -5.9562377 -0.92011249
H  -6.19796234 -4.91087815 -0.83952947
C  -4.55666035 -5.97650202 -1.73991861
H  -4.71448812 -5.35831777 -2.62916811
C  -4.1124992 -7.35759294 -2.20986112
C  -4.52547067 -7.81743225 -3.46377023
C  -3.29263736 -8.17474017 -1.42617525
C  -4.16605432 -9.08864758 -3.90973715
H  -5.10398599 -7.17025975 -4.11741196
C  -2.92542637 -9.4398948 -1.87405146
H  -2.93407899 -7.83195144 -0.46121763
C  -3.36877903 -9.9045702 -3.11180269
H  -4.49608731 -9.43003102 -4.88495993
H  -2.29088459 -10.06371563 -1.25388931
H  -3.07870569 -10.89088918 -3.45815058
C  -8.26357514 -6.8494876 -0.88266291
C  -7.41675607 -5.87726246 -2.96143272
C  -9.38226992 -6.7414128 -1.90251316
H  -8.31343531 -6.04307316 -0.14864669
H  -8.19099515 -7.80283764 -0.36360367
C  -8.90532998 -5.59191161 -2.78794338
H  -7.22930133 -6.53789859 -3.8073102
H  -6.80759057 -4.98082046 -3.06370839
H  -9.47733772 -7.66843935 -2.47647262
H  -10.33655479 -6.54068655 -1.41408026
H  -9.40757322 -5.55174995 -3.75505004
H  -9.05503018 -4.63322098 -2.28342451
N  -6.99416128 -6.62985032 -1.69605135
H  -6.64866971 -7.54929887 -1.98889023
