program: Gaussian 16
title: Title Card Required
version: ES64L-G16RevC.02
basis: 6-31+G(d,p)
method: UwB97XD TD-FC
operation: Force
keyword: #p
keyword: td=(nstates=30,root=3)
keyword: uwb97xd/6-31+g(d,p)
keyword: force
keyword: scrf=(CPCM,solvent=chloroform)
keyword: nosymm
keyword: scf=xqc
keyword: Guess=mix
keyword: density=current
title: #p td=(nstates=30,root=3) uwb97xd/6-31+g(d,p) force scrf=(CPCM,solvent
basis: NPDir=0 NMtPBC= 1 NCelOv= 1 NCel= 1 NClECP= 1 NCelD= 1
basis: NCelK= 1 NCelE2= 1 NClLst= 1 CellRange= 0.0.
basis: One-electron integrals computed using PRISM.
basis: NBasis= 859 RedAO= T EigKep= 1.08D-06 NBF= 859
basis: NBsUse= 855 1.00D-06 EigRej= 5.78D-07 NBFU= 855
converged: NO NO NO NO
hfenergy: -1479.2107758 hartree
pointgroup: C01 [X(C32H35N3O1)]
dipole: -4.5482192 -0.8895609 -1.0417915 debye
InChI: InChI=1/32C.3N.O.35H
charge 2 multiplicity 1
71 atoms
C  -0.22419897 -3.13264927 0.95558409
C  -1.52439479 -3.56581395 0.55452093
C  -2.64131904 -3.29716551 1.37346735
C  -2.43025672 -2.6949137 2.60926585
C  -1.13860826 -2.32426872 3.00364475
C  -0.01227048 -2.52692968 2.18289312
C  -0.04382752 -4.11400103 -1.06216198
C  -1.40478915 -4.19908695 -0.72107551
H  -3.64216029 -3.53776681 1.03561042
H  -3.27023816 -2.49578753 3.26441314
H  -0.99490396 -1.84705177 3.96612198
H  0.97382658 -2.22741654 2.50524739
N  0.65774852 -3.44202597 -0.08024318
H  0.43823065 -4.47996501 -1.95295671
C  2.02264843 -3.04010679 -0.12754803
O  2.50710575 -2.51268543 0.85046571
C  2.77588356 -3.2274636 -1.41817783
H  3.82284824 -3.34007497 -1.1322489
H  2.480572 -4.13217601 -1.95521682
C  2.63530122 -1.97740451 -2.32380052
H  3.36879011 -2.08314899 -3.12965901
H  2.91570722 -1.08959002 -1.74837199
C  1.26331757 -1.80896814 -2.91227775
H  0.96979473 -2.54212811 -3.66366256
C  0.40934877 -0.84097295 -2.5771768
H  0.66858329 -0.08652086 -1.83769174
H  -0.57011854 -0.76695591 -3.03938362
C  -2.47066096 -4.71720748 -1.50982681
H  -2.41027995 -4.72431094 -2.5911686
N  -3.55868246 -5.29772893 -0.93564304
H  -3.4658403 -5.6284501 0.01906101
C  -5.73525033 -5.63799876 1.55460732
C  -5.75112321 -6.52567827 0.47493839
C  -5.61302137 -7.89698937 0.71817378
C  -5.44665397 -8.36527859 2.01772721
C  -5.4078695 -7.47106728 3.08649213
C  -5.55617626 -6.10569503 2.85457869
H  -5.88002607 -4.57465678 1.38194257
H  -5.635286 -8.61194317 -0.09818586
H  -5.34729036 -9.43094708 2.19381581
H  -5.27508684 -7.83970493 4.09811899
H  -5.5475425 -5.40520098 3.68247078
C  -5.88906012 -5.9558021 -0.91984374
H  -6.19831803 -4.91017138 -0.83940948
C  -4.55752307 -5.97611953 -1.73936419
H  -4.71455522 -5.35802891 -2.62870808
C  -4.11360627 -7.35736586 -2.20981291
C  -4.52568233 -7.8176069 -3.46366425
C  -3.29336216 -8.17416813 -1.42618708
C  -4.16559969 -9.08858265 -3.90961621
H  -5.10449098 -7.17062206 -4.11758357
C  -2.92562283 -9.4390025 -1.87369739
H  -2.93493454 -7.83101678 -0.46132404
C  -3.36821633 -9.90443694 -3.11139617
H  -4.49528419 -9.43039572 -4.88486149
H  -2.2910476 -10.0626098 -1.25298459
H  -3.07791047 -10.89092798 -3.45730483
C  -8.26403416 -6.84962499 -0.88278889
C  -7.4171847 -5.87720882 -2.96149889
C  -9.3825709 -6.74151189 -1.90271997
H  -8.31411735 -6.04345178 -0.14860481
H  -8.1910806 -7.80311249 -0.36395923
C  -8.90569209 -5.59192983 -2.78800655
H  -7.22970218 -6.53811834 -3.8071131
H  -6.80806569 -4.98070777 -3.06421193
H  -9.47748787 -7.66849381 -2.47664683
H  -10.33681424 -6.54091337 -1.41428877
H  -9.40785411 -5.55175606 -3.75507809
H  -9.05562989 -4.63332816 -2.28354519
N  -6.99468613 -6.62957884 -1.69598092
H  -6.64845485 -7.5487561 -1.98868109
