program: Gaussian 16
title: Title Card Required
version: ES64L-G16RevC.02
basis: 6-31+G(d,p)
method: UwB97XD TD-FC
operation: Force
keyword: #p
keyword: td=(nstates=30,root=2)
keyword: uwb97xd/6-31+g(d,p)
keyword: force
keyword: scrf=(CPCM,solvent=chloroform)
keyword: nosymm
keyword: scf=xqc
keyword: Guess=mix
keyword: density=current
title: #p td=(nstates=30,root=2) uwb97xd/6-31+g(d,p) force scrf=(CPCM,solvent
basis: NPDir=0 NMtPBC= 1 NCelOv= 1 NCel= 1 NClECP= 1 NCelD= 1
basis: NCelK= 1 NCelE2= 1 NClLst= 1 CellRange= 0.0.
basis: One-electron integrals computed using PRISM.
basis: NBasis= 859 RedAO= T EigKep= 1.08D-06 NBF= 859
basis: NBsUse= 855 1.00D-06 EigRej= 5.77D-07 NBFU= 855
converged: NO NO NO NO
hfenergy: -1479.2107439 hartree
pointgroup: C01[X(C32H35N3O1)]
dipole: -3.7852124 -0.2204258 -0.4064714 debye
InChI: InChI=1/32C.3N.O.35H
charge 2 multiplicity 1
71 atoms
C  -0.22402019 -3.13123838 0.95461753
C  -1.52352949 -3.56709816 0.55386488
C  -2.64095795 -3.29902257 1.37198484
C  -2.43088648 -2.69849929 2.60960223
C  -1.1387882 -2.32866364 3.00432852
C  -0.0126889 -2.52622539 2.18208893
C  -0.04287838 -4.11588988 -1.06065724
C  -1.40346778 -4.20185529 -0.720753
H  -3.64160062 -3.53774866 1.03320734
H  -3.27091501 -2.49868892 3.26288513
H  -0.99582093 -1.85298956 3.96784081
H  0.97354883 -2.22695677 2.5059444
N  0.65874901 -3.44175683 -0.08078894
H  0.44227811 -4.48555899 -1.94922701
C  2.02299593 -3.03836831 -0.12817458
O  2.50645399 -2.50857676 0.84930846
C  2.77724877 -3.22599092 -1.41867324
H  3.82400848 -3.33765558 -1.13273662
H  2.48213692 -4.13023638 -1.95504579
C  2.63657115 -1.97579654 -2.32504674
H  3.3702095 -2.08232449 -3.13039482
H  2.91628833 -1.08766774 -1.74937836
C  1.26447101 -1.80780476 -2.91369619
H  0.97174651 -2.54019121 -3.66611095
C  0.40976061 -0.84060518 -2.57824408
H  0.66838554 -0.08624934 -1.83837392
H  -0.56924255 -0.76588402 -3.0414576
C  -2.46957405 -4.72086868 -1.50893855
H  -2.40810732 -4.7307924 -2.59055518
N  -3.56005313 -5.29738092 -0.93452916
H  -3.47005219 -5.625199 0.02115105
C  -5.73637043 -5.63723989 1.55539048
C  -5.751938 -6.52517138 0.47523972
C  -5.61373828 -7.89606249 0.71838869
C  -5.44697091 -8.36493062 2.01750413
C  -5.40767721 -7.47055975 3.08672822
C  -5.55658496 -6.10559747 2.85497262
H  -5.88202728 -4.57416802 1.38319446
H  -5.63621696 -8.61126136 -0.0980567
H  -5.34708324 -9.43049776 2.19354041
H  -5.27419688 -7.83958331 4.09799298
H  -5.54744585 -5.40499644 3.68324646
C  -5.89007801 -5.95495829 -0.91954526
H  -6.19909019 -4.90944517 -0.83909193
C  -4.55859122 -5.9757695 -1.73896148
H  -4.71404423 -5.3566696 -2.62768283
C  -4.11489097 -7.35705252 -2.2097126
C  -4.52640891 -7.8175693 -3.46368954
C  -3.29439533 -8.1734187 -1.4258115
C  -4.16514378 -9.08862525 -3.90962382
H  -5.10514105 -7.17111688 -4.11824983
C  -2.92574238 -9.43806778 -1.87291874
H  -2.93583588 -7.82956746 -0.46123881
C  -3.36744517 -9.9037004 -3.11060349
H  -4.49409434 -9.43060679 -4.88482298
H  -2.2909042 -10.06105083 -1.25162166
H  -3.07723053 -10.89056361 -3.45597845
C  -8.26456552 -6.84974194 -0.88300278
C  -7.41770633 -5.87703604 -2.96156801
C  -9.38298879 -6.74166846 -1.90298843
H  -8.31515339 -6.04393758 -0.14847666
H  -8.19126231 -7.8034128 -0.36449885
C  -8.90625014 -5.59205848 -2.78811002
H  -7.23031713 -6.53841508 -3.8068239
H  -6.808637 -4.98060817 -3.06492843
H  -9.47780479 -7.66857363 -2.47689245
H  -10.33719618 -6.54121643 -1.41451998
H  -9.40832584 -5.5518216 -3.75521236
H  -9.0564618 -4.63351743 -2.28361771
N  -6.99513871 -6.62913596 -1.69584857
H  -6.64793331 -7.5480672 -1.98834068
