program: Gaussian 16
title: Title Card Required
version: ES64L-G16RevC.02
basis: 6-31+G(d,p)
method: UwB97XD TD-FC
operation: Force
keyword: #p
keyword: td=(nstates=30,root=3)
keyword: uwb97xd/6-31+g(d,p)
keyword: force
keyword: scrf=(CPCM,solvent=chloroform)
keyword: nosymm
keyword: scf=xqc
keyword: Guess=mix
keyword: density=current
title: #p td=(nstates=30,root=3) uwb97xd/6-31+g(d,p) force scrf=(CPCM,solvent
basis: NPDir=0 NMtPBC= 1 NCelOv= 1 NCel= 1 NClECP= 1 NCelD= 1
basis: NCelK= 1 NCelE2= 1 NClLst= 1 CellRange= 0.0.
basis: One-electron integrals computed using PRISM.
basis: NBasis= 859 RedAO= T EigKep= 1.07D-06 NBF= 859
basis: NBsUse= 855 1.00D-06 EigRej= 5.76D-07 NBFU= 855
converged: NO NO NO NO
hfenergy: -1479.2108741 hartree
pointgroup: C01 [X(C32H35N3O1)]
dipole: -4.5565598 -0.8982723 -1.0218128 debye
InChI: InChI=1/32C.3N.O.35H
charge 2 multiplicity 1
71 atoms
C  -0.22368408 -3.12830945 0.95242861
C  -1.52190702 -3.56897528 0.55248898
C  -2.63982416 -3.30216853 1.3704281
C  -2.43113291 -2.70556605 2.60933431
C  -1.14054708 -2.33481126 3.00528848
C  -0.01395819 -2.52796723 2.18209939
C  -0.03996932 -4.11890498 -1.05964374
C  -1.4010469 -4.20645965 -0.72070023
H  -3.64052958 -3.53747751 1.02932708
H  -3.27247144 -2.50407252 3.26100508
H  -0.99741133 -1.8642887 3.97115925
H  0.97109076 -2.22578545 2.50625071
N  0.66012241 -3.43977204 -0.08239801
H  0.44795011 -4.49365936 -1.94366245
C  2.02436435 -3.03448346 -0.12999386
O  2.50692254 -2.50232634 0.84639489
C  2.77983597 -3.22175141 -1.41924513
H  3.82703959 -3.33410444 -1.13311619
H  2.48490586 -4.126542 -1.95488185
C  2.63842117 -1.97303816 -2.32641652
H  3.37263688 -2.0821614 -3.13137748
H  2.91704045 -1.08448433 -1.75074963
C  1.2662044 -1.80589632 -2.91618406
H  0.97514479 -2.53656962 -3.67101308
C  0.41030235 -0.83963856 -2.58029182
H  0.66814954 -0.08581375 -1.83973709
H  -0.5679958 -0.76396582 -3.04491618
C  -2.46675073 -4.72974286 -1.50748587
H  -2.40246056 -4.74684401 -2.58922032
N  -3.56120192 -5.29782155 -0.93288169
H  -3.48088946 -5.61793016 0.02620496
C  -5.73837598 -5.63642099 1.55648999
C  -5.75315994 -6.52367884 0.47578319
C  -5.61507226 -7.89482324 0.71856938
C  -5.44771461 -8.3639975 2.01748262
C  -5.40793557 -7.47016193 3.08691172
C  -5.55745395 -6.10510633 2.85589921
H  -5.88573249 -4.57331719 1.38533968
H  -5.63794885 -8.60998277 -0.09781455
H  -5.34638057 -9.42946522 2.19304358
H  -5.27248442 -7.83937097 4.09787042
H  -5.54678342 -5.40491372 3.68442188
C  -5.89123677 -5.9533942 -0.91921316
H  -6.20127932 -4.90821646 -0.83821025
C  -4.56001236 -5.97457748 -1.73860585
H  -4.71288478 -5.3527825 -2.6258313
C  -4.11648103 -7.35652344 -2.20949965
C  -4.52790658 -7.81746713 -3.46408021
C  -3.29608259 -8.17188925 -1.42470417
C  -4.16445681 -9.08825036 -3.90878669
H  -5.10626913 -7.17211883 -4.11998618
C  -2.9257591 -9.43640729 -1.87071149
H  -2.93712565 -7.82675049 -0.46047469
C  -3.36675402 -9.90197031 -3.10921854
H  -4.49173327 -9.43052157 -4.88488616
H  -2.29016253 -10.05820299 -1.24928743
H  -3.0765043 -10.88896411 -3.45348704
C  -8.26534916 -6.84993819 -0.88330491
C  -7.41862386 -5.87680914 -2.96167704
C  -9.38374481 -6.74208174 -1.90334062
H  -8.31709732 -6.04477157 -0.14819575
H  -8.19180602 -7.80383343 -0.36556129
C  -8.90728585 -5.59219545 -2.78839788
H  -7.23153325 -6.5389467 -3.80635699
H  -6.80947207 -4.98050494 -3.06613111
H  -9.47861993 -7.66888381 -2.47747362
H  -10.33802741 -6.54175007 -1.41484344
H  -9.40932905 -5.55207159 -3.75561779
H  -9.05796357 -4.63391898 -2.28358748
N  -6.9956369 -6.62820575 -1.6955674
H  -6.64692917 -7.54672727 -1.98765179
