program: Gaussian 16
title: Title Card Required
version: ES64L-G16RevC.02
basis: 6-31+G(d,p)
method: UwB97XD TD-FC
operation: Force
keyword: #p
keyword: td=(nstates=30,root=2)
keyword: uwb97xd/6-31+g(d,p)
keyword: force
keyword: scrf=(CPCM,solvent=chloroform)
keyword: nosymm
keyword: scf=xqc
keyword: Guess=mix
keyword: density=current
title: #p td=(nstates=30,root=2) uwb97xd/6-31+g(d,p) force scrf=(CPCM,solvent
basis: NPDir=0 NMtPBC= 1 NCelOv= 1 NCel= 1 NClECP= 1 NCelD= 1
basis: NCelK= 1 NCelE2= 1 NClLst= 1 CellRange= 0.0.
basis: One-electron integrals computed using PRISM.
basis: NBasis= 859 RedAO= T EigKep= 1.07D-06 NBF= 859
basis: NBsUse= 855 1.00D-06 EigRej= 5.75D-07 NBFU= 855
converged: NO NO NO NO
hfenergy: -1479.2108185 hartree
pointgroup: C01 [X(C32H35N3O1)]
dipole: -4.5604641 -0.8998355 -1.0187998 debye
InChI: InChI=1/32C.3N.O.35H
charge 2 multiplicity 1
71 atoms
C  -0.22351568 -3.1279316 0.95212534
C  -1.52150291 -3.56884871 0.55185232
C  -2.63960605 -3.30235009 1.36975314
C  -2.43122912 -2.70615773 2.60887724
C  -1.14100565 -2.33536951 3.00553617
C  -0.01402243 -2.52871284 2.18235127
C  -0.03899036 -4.1206391 -1.0591284
C  -1.40048095 -4.20749485 -0.72075451
H  -3.63996771 -3.53788479 1.02855261
H  -3.27277637 -2.50526566 3.26068661
H  -0.9975851 -1.86761071 3.97247105
H  0.96984138 -2.22503279 2.50610597
N  0.66101314 -3.4393727 -0.08233469
H  0.44911784 -4.49780845 -1.9423467
C  2.02459404 -3.03333566 -0.1304051
O  2.50727627 -2.50053875 0.84550651
C  2.78044574 -3.22103335 -1.41935051
H  3.82765948 -3.33333952 -1.13284895
H  2.48563738 -4.12531656 -1.95499955
C  2.63869863 -1.97242037 -2.32675647
H  3.37293221 -2.08244355 -3.13115767
H  2.91720647 -1.08368693 -1.75104291
C  1.26654713 -1.80549232 -2.91684249
H  0.97600275 -2.53562449 -3.67223474
C  0.41043172 -0.839285 -2.58092783
H  0.66810707 -0.08572289 -1.84002079
H  -0.56780235 -0.76355697 -3.04561662
C  -2.46576604 -4.73109257 -1.50705546
H  -2.40299127 -4.7466948 -2.58958842
N  -3.5608263 -5.2988672 -0.9327863
H  -3.48289944 -5.61691978 0.0276712
C  -5.73899376 -5.63628415 1.55677688
C  -5.75350829 -6.52334603 0.47604311
C  -5.615515 -7.89456047 0.71861418
C  -5.44798402 -8.36371843 2.01755611
C  -5.40815446 -7.47012799 3.08709858
C  -5.55776595 -6.10504123 2.85612643
H  -5.88672734 -4.57318716 1.38585721
H  -5.63845512 -8.6096187 -0.09771975
H  -5.34607077 -9.42920663 2.19297896
H  -5.27196615 -7.8393411 4.09791754
H  -5.54644061 -5.40496783 3.6847387
C  -5.89140679 -5.95293226 -0.91911075
H  -6.20175062 -4.9078889 -0.83796054
C  -4.55964572 -5.97422959 -1.73845915
H  -4.71237664 -5.35152948 -2.62541118
C  -4.11693546 -7.35639198 -2.20961787
C  -4.52831875 -7.81769667 -3.46428405
C  -3.29651278 -8.17167497 -1.42454914
C  -4.16442216 -9.08842971 -3.90858175
H  -5.10669451 -7.1729174 -4.12070439
C  -2.92586034 -9.43628085 -1.87016045
H  -2.93755698 -7.82620449 -0.46031095
C  -3.3669115 -9.90184566 -3.10884898
H  -4.49072312 -9.43063082 -4.88495478
H  -2.28979286 -10.05769247 -1.249056
H  -3.07623996 -10.88859986 -3.4531772
C  -8.26545485 -6.84995576 -0.88341203
C  -7.41877731 -5.87675822 -2.96166625
C  -9.38393876 -6.74220616 -1.9034464
H  -8.31760688 -6.04495484 -0.14808882
H  -8.19204982 -7.80399384 -0.3658125
C  -8.90753342 -5.59223025 -2.78846458
H  -7.2318795 -6.53909311 -3.80625377
H  -6.80958334 -4.98054574 -3.0663572
H  -9.47891925 -7.669006 -2.47767566
H  -10.33827271 -6.54189257 -1.41491801
H  -9.40959766 -5.55217072 -3.75573342
H  -9.05837542 -4.63399377 -2.28351545
N  -6.99580919 -6.6278748 -1.69545222
H  -6.64677382 -7.54637511 -1.9874939
