program: Gaussian 16
title: Title Card Required
version: ES64L-G16RevC.02
basis: 6-31+G(d,p)
method: UwB97XD TD-FC
operation: Force
keyword: #p
keyword: td=(nstates=30,root=2)
keyword: uwb97xd/6-31+g(d,p)
keyword: force
keyword: scrf=(CPCM,solvent=chloroform)
keyword: nosymm
keyword: scf=xqc
keyword: Guess=mix
keyword: density=current
title: #p td=(nstates=30,root=2) uwb97xd/6-31+g(d,p) force scrf=(CPCM,solvent
basis: NPDir=0 NMtPBC= 1 NCelOv= 1 NCel= 1 NClECP= 1 NCelD= 1
basis: NCelK= 1 NCelE2= 1 NClLst= 1 CellRange= 0.0.
basis: One-electron integrals computed using PRISM.
basis: NBasis= 859 RedAO= T EigKep= 1.07D-06 NBF= 859
basis: NBsUse= 855 1.00D-06 EigRej= 5.72D-07 NBFU= 855
converged: NO NO NO NO
hfenergy: -1479.2110694 hartree
pointgroup: C01 [X(C32H35N3O1)]
dipole: -4.5671216 -0.9052403 -1.016421 debye
InChI: InChI=1/32C.3N.O.35H
charge 2 multiplicity 1
71 atoms
C  -0.22372765 -3.12848404 0.95107642
C  -1.52080163 -3.56768184 0.55049772
C  -2.63929995 -3.30257678 1.36857898
C  -2.43214198 -2.70638915 2.60813972
C  -1.14217934 -2.33673322 3.00546353
C  -0.01512136 -2.52989291 2.18206257
C  -0.03648726 -4.12251674 -1.05858353
C  -1.39865109 -4.2090952 -0.72032562
H  -3.63957901 -3.53920757 1.02740967
H  -3.27337208 -2.50942554 3.26085249
H  -0.99815946 -1.87354663 3.97469801
H  0.96842225 -2.22446148 2.50605902
N  0.66158948 -3.43886112 -0.08323162
H  0.44936944 -4.49960319 -1.94339157
C  2.02532614 -3.03141109 -0.13111484
O  2.50790952 -2.49851519 0.84474378
C  2.78116506 -3.21941457 -1.41926989
H  3.82825363 -3.33186639 -1.1321814
H  2.48673235 -4.12389599 -1.95583581
C  2.63893494 -1.97126141 -2.32699967
H  3.37345302 -2.08250904 -3.13103296
H  2.91759431 -1.08256696 -1.75218281
C  1.267327 -1.80447519 -2.91806109
H  0.97743212 -2.53411401 -3.67448544
C  0.41093843 -0.83857738 -2.5822214
H  0.66812759 -0.08562883 -1.84052188
H  -0.56748895 -0.76302687 -3.04671407
C  -2.4622942 -4.7366706 -1.50597917
H  -2.39903135 -4.75553245 -2.5878027
N  -3.55948562 -5.30044542 -0.93218532
H  -3.48849609 -5.61141448 0.03131398
C  -5.73991718 -5.63601199 1.55715723
C  -5.75444901 -6.52282146 0.47615753
C  -5.61617659 -7.8940774 0.71873976
C  -5.44833073 -8.36336278 2.01760165
C  -5.40846479 -7.469965 3.08726063
C  -5.55816678 -6.10490939 2.85646919
H  -5.88816263 -4.57293343 1.3864195
H  -5.63908295 -8.60895349 -0.09786757
H  -5.34555984 -9.42873435 2.19272461
H  -5.27132501 -7.83928665 4.09792897
H  -5.5458407 -5.40501824 3.6850383
C  -5.89172098 -5.95228598 -0.91871605
H  -6.20275859 -4.90727566 -0.8376644
C  -4.55947647 -5.97351294 -1.73803036
H  -4.71161947 -5.34951216 -2.62449749
C  -4.11778883 -7.35567629 -2.20979807
C  -4.52866411 -7.81723515 -3.46396691
C  -3.29712664 -8.17055254 -1.42408241
C  -4.16463913 -9.08798204 -3.90800563
H  -5.10701863 -7.17340258 -4.12160379
C  -2.92640534 -9.43526708 -1.86935467
H  -2.93853165 -7.82419356 -0.46012612
C  -3.36730871 -9.90147219 -3.10733745
H  -4.48907746 -9.43044584 -4.88489272
H  -2.28903943 -10.0563862 -1.24846618
H  -3.07587833 -10.88763596 -3.45245368
C  -8.26589125 -6.85012823 -0.8835232
C  -7.4191894 -5.87677907 -2.9617663
C  -9.38437423 -6.74243725 -1.90374042
H  -8.31830102 -6.04522864 -0.14800509
H  -8.1924864 -7.80431828 -0.36615311
C  -8.90804387 -5.59230101 -2.78854331
H  -7.23246676 -6.53937028 -3.80621227
H  -6.80977697 -4.98069372 -3.06664109
H  -9.47949659 -7.66923387 -2.47794111
H  -10.33863368 -6.54218019 -1.4150232
H  -9.41007858 -5.55239758 -3.75582078
H  -9.05902181 -4.63418154 -2.28345792
N  -6.99589493 -6.62747513 -1.69541898
H  -6.64683075 -7.54580956 -1.98736035
