program: Gaussian 16
title: Title Card Required
version: ES64L-G16RevC.02
basis: 6-31+G(d,p)
method: UwB97XD TD-FC
operation: Force
keyword: #p
keyword: td=(nstates=30,root=2)
keyword: uwb97xd/6-31+g(d,p)
keyword: force
keyword: scrf=(CPCM,solvent=chloroform)
keyword: nosymm
keyword: scf=xqc
keyword: Guess=mix
keyword: density=current
title: #p td=(nstates=30,root=2) uwb97xd/6-31+g(d,p) force scrf=(CPCM,solvent
basis: NPDir=0 NMtPBC= 1 NCelOv= 1 NCel= 1 NClECP= 1 NCelD= 1
basis: NCelK= 1 NCelE2= 1 NClLst= 1 CellRange= 0.0.
basis: One-electron integrals computed using PRISM.
basis: NBasis= 859 RedAO= T EigKep= 1.07D-06 NBF= 859
basis: NBsUse= 855 1.00D-06 EigRej= 5.70D-07 NBFU= 855
converged: NO NO NO NO
hfenergy: -1479.2112344 hartree
pointgroup: C01 [X(C32H35N3O1)]
dipole: -3.8055862 -0.2381307 -0.4098876 debye
InChI: InChI=1/32C.3N.O.35H
charge 2 multiplicity 1
71 atoms
C  -0.22353188 -3.12837425 0.95101742
C  -1.5211186 -3.56761184 0.54957374
C  -2.63942358 -3.30272484 1.3678328
C  -2.43257443 -2.70668903 2.60775072
C  -1.14277734 -2.33789533 3.00550946
C  -0.0156202 -2.53013771 2.18150875
C  -0.03567783 -4.12314716 -1.05925674
C  -1.39766315 -4.20995896 -0.7203557
H  -3.63950591 -3.53995739 1.02694102
H  -3.27397562 -2.51221301 3.26139085
H  -0.99860304 -1.87622507 3.97547122
H  0.96780298 -2.22483617 2.50605301
N  0.66211474 -3.4382605 -0.08387771
H  0.44886311 -4.49746755 -1.94512226
C  2.02534115 -3.03079114 -0.13125552
O  2.50826688 -2.49791844 0.84498731
C  2.78138492 -3.21888966 -1.41967075
H  3.82832976 -3.33101844 -1.13189542
H  2.48727456 -4.12319971 -1.95619265
C  2.63924321 -1.97104343 -2.3273488
H  3.37366883 -2.08223106 -3.13106697
H  2.91789917 -1.08180656 -1.75279835
C  1.26758778 -1.80391029 -2.91879637
H  0.97815658 -2.53336084 -3.67547691
C  0.41123846 -0.83824966 -2.58289671
H  0.66817191 -0.08558178 -1.84076384
H  -0.56725563 -0.76283056 -3.04722143
C  -2.45978144 -4.74070272 -1.50461715
H  -2.39447609 -4.76484773 -2.5861052
N  -3.5589552 -5.30104215 -0.93159591
H  -3.49220114 -5.60686938 0.03329271
C  -5.74027681 -5.63583749 1.55725426
C  -5.75494644 -6.52266537 0.47634875
C  -5.61643197 -7.89388897 0.71869197
C  -5.44844249 -8.3631892 2.01748837
C  -5.40850475 -7.46986634 3.08725908
C  -5.55828937 -6.10482592 2.8564696
H  -5.8886935 -4.57280217 1.38656434
H  -5.6392482 -8.6085797 -0.09798167
H  -5.34536317 -9.42854952 2.19254556
H  -5.27116048 -7.83925406 4.09790389
H  -5.54560734 -5.40494808 3.68513436
C  -5.89193624 -5.95181397 -0.9187171
H  -6.20330052 -4.90709225 -0.8375762
C  -4.55972354 -5.97298406 -1.73768771
H  -4.71140407 -5.34875363 -2.62394226
C  -4.11822098 -7.35497789 -2.20973434
C  -4.52869596 -7.81675813 -3.46375322
C  -3.29724296 -8.16974944 -1.42362991
C  -4.16476778 -9.0875464 -3.90769172
H  -5.10696186 -7.17305016 -4.12177112
C  -2.92660532 -9.43447113 -1.86875551
H  -2.93907219 -7.82277963 -0.46012962
C  -3.36758214 -9.90098973 -3.106472
H  -4.48843379 -9.43006443 -4.88459141
H  -2.28883358 -10.05539028 -1.24812881
H  -3.07577247 -10.88705492 -3.45193682
C  -8.26621743 -6.85022205 -0.88356446
C  -7.41943202 -5.87676772 -2.96186166
C  -9.38455593 -6.74254185 -1.90382425
H  -8.31854032 -6.04539339 -0.14806154
H  -8.19266405 -7.80447087 -0.36628464
C  -8.90825144 -5.5923845 -2.78858374
H  -7.23272778 -6.53950914 -3.8062456
H  -6.80992531 -4.9808048 -3.06676113
H  -9.47977336 -7.66934669 -2.47803572
H  -10.33877271 -6.5423338 -1.41507039
H  -9.41031304 -5.5525053 -3.75582291
H  -9.05929872 -4.63428313 -2.28346831
N  -6.99607937 -6.62730645 -1.69539279
H  -6.64689155 -7.54570101 -1.98739639
