program: Gaussian 09
title: 000006845
version: EM64L-G09RevD.01
frameworkgroup: C1[X(C11H9Cl)]
method: RPBEPBE
basis: SDD
operation: Freq
keyword: #pfreq=noraman
keyword: PBEPBE/SDD
title: #p freq=noraman PBEPBE/SDD
converged: NO NO NO NO
title: Mulliken charges:
elementType: Cl C C C C C C C C C C C H H H H H H H H H
charge: -0.088219 0.208999 0.407153 0.450569 -0.367832 -0.435705 -0.418649 -0.422730 -0.240654 -0.813596 -0.254313 -0.239291 0.257540 0.240843 0.235710 0.238298 0.231886 0.272445 0.276828 0.229958 0.230761
chargesum: 0.00000
title: Mulliken charges with hydrogens summed into heavy atoms:
elementType: Cl C C C C C C C C C C C
charge: -0.088219 0.208999 0.407153 0.450569 -0.110292 -0.194862 -0.182939 -0.184432 -0.008768 -0.264323 -0.024356 -0.008530
polarizability: 1.60013711e+02 8.61494418e+00 1.60295492e+02 7.94365693e+00 -2.05891612e+00 6.37412701e+01
1716.lowfreq: -7.6027 -0.0014 0.0016 0.0019 5.7957 7.7465 62.9463 82.9600 161.7641
frequency: 62.9242 82.9559 161.7640 178.0101 269.2466 287.1719 408.8593 423.5850 470.5168 483.9146 505.7751 523.8697 575.8107 605.8456 670.3889 699.6117 746.9188 784.1939 791.1710 815.0651 861.3376 882.6518 905.8664 927.2879 962.9717 986.6757 995.4012 1022.4042 1046.2752 1081.1134 1130.9590 1153.2460 1176.9404 1185.0225 1236.4844 1247.7762 1255.1354 1282.5010 1380.7478 1407.9469 1420.6064 1441.8935 1456.4068 1468.2717 1517.3762 1588.0946 1598.5346 1634.2847 3065.5020 3121.6692 3122.6732 3129.1809 3134.7950 3145.0045 3151.4250 3159.4220 3165.9293
redmass: 6.7321 6.2296 4.9027 4.0702 3.6329 3.5540 3.4857 3.0751 3.3192 5.0557 5.7289 4.6696 6.1316 3.8157 3.3664 5.0340 1.3669 4.0305 1.9963 1.6037 3.0449 1.9216 1.7645 1.4541 1.3785 1.3681 1.3574 3.0702 2.3309 2.3094 1.1318 1.3921 1.1114 1.2322 1.7678 1.1679 1.8004 1.8871 2.2099 3.0334 5.5224 2.3514 2.5117 1.1583 3.7531 7.4861 5.2575 6.5478 1.0578 1.0868 1.0865 1.0919 1.0887 1.1094 1.0952 1.0989 1.1002
irintensity: 1.4275 1.3139 2.3765 2.1301 2.3735 1.9662 2.8968 3.7823 0.8181 7.9799 2.1234 36.4615 32.6958 17.3490 8.7929 7.4230 4.1742 14.2741 83.3406 45.5241 4.7502 4.6306 1.5297 0.2502 1.7666 2.0588 0.7905 6.4787 2.8040 4.0292 5.1299 7.6889 3.4745 5.1338 8.7015 15.3453 26.2456 1.9174 4.2568 1.1868 0.4624 2.3537 1.6274 12.6487 14.1344 4.2833 1.9322 0.2659 21.3863 1.5157 0.8974 15.5354 7.9761 9.4831 22.4020 33.7140 20.9909
temp: 298.150 k
press: 1.00000 atm
elementType: 17 6 6 6 6 6 6 6 6 6 6 6 1 1 1 1 1 1 1 1 1
symmnumber: 1
zpe: 430640.2 jmol-1
zpe.correction: 0.164022 hartree
zpe.thermalcorrener: 0.173564 hartree
zpe.thermalcorrenthalpy: 0.174508 hartree
zpe.thermalcorrgfe: 0.128297 hartree
zpe.sumelectzpe: -883.813194 hartree
zpe.sumelectthermal: -883.803652 hartree
zpe.sumelectthermalent: -883.802708 hartree
zpe.sumelectthermalfe: -883.848919 hartree
dipole: -1.8675 1.1829 1.4602
dipole: 2.6493
quadrupole: -74.0968 -67.2923 -80.5893
quadrupole: 3.9792 6.8583 -2.0200
quadrupole: -0.1040 6.7005 -6.5965 3.9792 6.8583 -2.0200
hfenergy: -883.9772161 hartree
pointgroup: C01 [X(C11H9Cl1)]
dipole: 0.4847674 0.6729691 -0.6313084 debye
dipolederiv: -0.3728128 -0.1962027 0.0536531 -0.3424533 -0.5309958 0.1334469 0.3198115 0.360795 -0.3761546 0.0512487 -0.0465355 -0.0173576 -0.2130126 -0.0638007 -0.0107434 -0.0121145 -0.0265032 0.0096927 0.0301644 -0.0916598 -0.0218768 -0.0476391 -0.1165926 -0.0179404 -0.0181198 -0.0340243 0.0619377 -0.044772 -0.0612128 -0.0112089 -0.1286851 -0.1580779 0.0303815 -0.1033533 -0.0850393 -0.1293812 -0.086249 0.0626217 0.0095649 0.0970566 0.0520729 0.0182976 -0.0233442 0.0049936 -0.1495814 0.0707446 0.0760609 0.0384346 -0.0434963 0.0729904 0.0402958 0.0278968 0.0402296 -0.1574786 0.0755129 -0.0032587 0.0499945 0.125365 -0.0158825 0.0227206 0.0551919 0.0545122 -0.1367295 0.0347433 0.0396683 0.0284915 0.1199158 0.061281 0.0368376 0.0399882 0.0329358 -0.1674908 -0.2070188 -0.0820127 0.0027702 -0.0422674 0.1234521 0.0246903 -0.0255391 0.0117491 -0.1416593 0.4513335 0.3135026 -0.0859847 0.4861219 0.6600465 -0.2326482 -0.2566248 -0.3494289 0.4733889 -0.0505966 -0.0132702 0.0128806 -0.0110429 0.1614357 0.025919 0.0265863 0.018818 -0.1499629 0.1297756 0.0229315 0.0382483 0.0110574 -0.1141304 0.0054254 0.0361991 0.0099489 -0.1517389 0.0368213 -0.0980155 -0.0315848 -0.0578278 -0.0110568 -0.0216123 -0.0110843 -0.013798 0.1390189 0.0037217 -0.1228725 -0.0312506 -0.0548356 -0.0254099 -0.0276509 -0.0209126 -0.0339579 0.1456499 -0.1197181 0.0343374 -0.030749 0.0057746 0.0921464 -0.0136772 -0.0298259 0.0012286 0.1368109 0.0138081 -0.052222 -0.0221194 -0.1209506 -0.0442042 -0.0359848 -0.030185 -0.029763 0.1489312 0.0563838 0.0804931 -0.0029971 0.0680534 -0.1025077 -0.0196977 -0.0089628 -0.0242269 0.158422 0.0716421 0.0371575 0.0936563 -0.0565843 -0.0587523 -0.0343689 0.0784527 0.0105752 -0.0461158 -0.0619057 -0.0072772 -0.0403256 0.0809479 0.0244939 0.0963236 -0.0037364 0.0676578 0.0189756 0.0493847 0.074042 -0.0028795 0.0868082 -0.0935166 -0.0167356 -0.0084397 -0.0138096 0.1557602 -0.1322118 0.0337244 -0.02936 0.0376944 0.0870084 -0.003279 -0.0318841 -0.0028927 0.1577049 unknown
polarizability: 166.4404824|-5.7131195|154.3713538|4.7806839|-1.0085731|63.2386364 unknown
InChI: InChI=1S/C11H9Cl/c12-8-10-6-3-5-9-4-1-2-7-11(9)10/h1-7H,8H2
charge 0 multiplicity 1
21 atoms
Cl -2.709174 -2.219224 0.887277
C  0.068651 -0.262965 -0.160086
C  0.9498 0.863549 0.082637
C  -1.349075 -0.016943 -0.324692
C  0.642583 -1.57672 -0.220912
C  0.399848 2.185541 0.175128
C  -1.840496 1.292552 -0.218272
C  2.358692 0.635855 0.229927
C  -0.971403 2.397286 0.033012
C  -2.303407 -1.125627 -0.647577
C  2.018507 -1.767536 -0.072713
C  2.887602 -0.652848 0.150368
H  -0.011236 -2.443546 -0.358997
H  1.077672 3.027212 0.362091
H  -2.916232 1.47218 -0.333592
H  3.01386 1.497104 0.408671
H  -1.389096 3.406695 0.108701
H  -1.914536 -1.850358 -1.377292
H  -3.285915 -0.749595 -0.96307
H  2.438406 -2.778495 -0.117344
H  3.964447 -0.818618 0.263836
