program: Gaussian 16
title: Title Card Required
version: ES64L-G16RevC.02
basis: 6-31+G(d,p)
method: UwB97XD TD-FC
operation: Force
keyword: #p
keyword: td=(nstates=30,root=2)
keyword: uwb97xd/6-31+g(d,p)
keyword: force
keyword: scrf=(CPCM,solvent=chloroform)
keyword: nosymm
keyword: scf=xqc
keyword: Guess=mix
keyword: density=current
title: #p td=(nstates=30,root=2) uwb97xd/6-31+g(d,p) force scrf=(CPCM,solvent
basis: NPDir=0 NMtPBC= 1 NCelOv= 1 NCel= 1 NClECP= 1 NCelD= 1
basis: NCelK= 1 NCelE2= 1 NClLst= 1 CellRange= 0.0.
basis: One-electron integrals computed using PRISM.
basis: NBasis= 859 RedAO= T EigKep= 1.07D-06 NBF= 859
basis: NBsUse= 855 1.00D-06 EigRej= 5.72D-07 NBFU= 855
converged: NO NO NO NO
hfenergy: -1479.2112829 hartree
pointgroup: C01 [X(C32H35N3O1)]
dipole: -4.5752806 -0.9094828 -1.0103271 debye
InChI: InChI=1/32C.3N.O.35H
charge 2 multiplicity 1
71 atoms
C  -0.22313977 -3.12784619 0.95070252
C  -1.51995062 -3.56734008 0.54951721
C  -2.64007323 -3.29921011 1.36523092
C  -2.43372568 -2.70428676 2.60627011
C  -1.1425645 -2.33856069 3.00627658
C  -0.01595363 -2.52826823 2.18081656
C  -0.03391459 -4.1254717 -1.05880057
C  -1.39660738 -4.21179153 -0.71999845
H  -3.63945829 -3.54278696 1.02690144
H  -3.27436704 -2.51426093 3.26216387
H  -0.99831393 -1.87910017 3.97713723
H  0.96778034 -2.22451821 2.50630209
N  0.66299635 -3.44003931 -0.08253622
H  0.44825766 -4.50142025 -1.94657004
C  2.02620906 -3.03119555 -0.13034029
O  2.50775115 -2.49618045 0.84502149
C  2.78070952 -3.21901658 -1.41900214
H  3.82716812 -3.3300421 -1.13099046
H  2.4876211 -4.12285435 -1.95744278
C  2.63909467 -1.97055636 -2.32735729
H  3.3738284 -2.08201066 -3.13114511
H  2.91815612 -1.08126007 -1.75371765
C  1.2680994 -1.80343758 -2.91948246
H  0.97871752 -2.53286893 -3.67623691
C  0.41149471 -0.83776979 -2.58352932
H  0.66820818 -0.08561263 -1.8408345
H  -0.56725147 -0.76279877 -3.0474324
C  -2.45953893 -4.74100588 -1.50440771
H  -2.39541569 -4.76077916 -2.58615456
N  -3.55677616 -5.30349116 -0.93141682
H  -3.49187472 -5.60488785 0.03565958
C  -5.74101198 -5.63580642 1.55754186
C  -5.75540026 -6.52240975 0.47638298
C  -5.6170596 -7.89364277 0.71880258
C  -5.44870028 -8.36326352 2.01751858
C  -5.40838803 -7.46990717 3.08738627
C  -5.55858365 -6.10485292 2.85675886
H  -5.88921236 -4.57276389 1.38658485
H  -5.6394627 -8.60822981 -0.09804429
H  -5.3449833 -9.42860928 2.19257553
H  -5.27096845 -7.83924277 4.09807924
H  -5.54518225 -5.40485974 3.68532007
C  -5.89221482 -5.95163008 -0.91850393
H  -6.20315957 -4.90638788 -0.83748428
C  -4.55890645 -5.97304782 -1.73728957
H  -4.71059231 -5.34810766 -2.62343721
C  -4.11851161 -7.35500937 -2.21003568
C  -4.52893852 -7.81716569 -3.46422792
C  -3.29790603 -8.16921383 -1.42425759
C  -4.16471823 -9.08822183 -3.90676808
H  -5.10720878 -7.17383394 -4.12218392
C  -2.92731089 -9.43443266 -1.86851526
H  -2.93992528 -7.82180795 -0.4603623
C  -3.36831179 -9.90161733 -3.10615563
H  -4.48692392 -9.43016425 -4.88438572
H  -2.28866276 -10.0547227 -1.24897848
H  -3.07534329 -10.88691624 -3.45222053
C  -8.26629845 -6.85037038 -0.88367163
C  -7.41957536 -5.87684016 -2.96186616
C  -9.38463505 -6.74267555 -1.90385389
H  -8.31880285 -6.04555506 -0.1481082
H  -8.1930076 -7.80459332 -0.3664061
C  -8.90833357 -5.5924531 -2.78855643
H  -7.23300343 -6.53959121 -3.8061821
H  -6.80987909 -4.98098032 -3.06675661
H  -9.48014841 -7.66934921 -2.4781155
H  -10.33886881 -6.54252276 -1.41521343
H  -9.41045852 -5.55258295 -3.75570624
H  -9.05963876 -4.63440621 -2.28349475
N  -6.99638991 -6.62724016 -1.69546823
H  -6.64729771 -7.54554927 -1.98750322
