program: Gaussian 16
title: Title Card Required
version: ES64L-G16RevC.02
basis: 6-31+G(d,p)
method: UwB97XD TD-FC
operation: Force
keyword: #p
keyword: td=(nstates=30,root=2)
keyword: uwb97xd/6-31+g(d,p)
keyword: force
keyword: scrf=(CPCM,solvent=chloroform)
keyword: nosymm
keyword: scf=xqc
keyword: Guess=mix
keyword: density=current
title: #p td=(nstates=30,root=2) uwb97xd/6-31+g(d,p) force scrf=(CPCM,solvent
basis: NPDir=0 NMtPBC= 1 NCelOv= 1 NCel= 1 NClECP= 1 NCelD= 1
basis: NCelK= 1 NCelE2= 1 NClLst= 1 CellRange= 0.0.
basis: One-electron integrals computed using PRISM.
basis: NBasis= 859 RedAO= T EigKep= 1.06D-06 NBF= 859
basis: NBsUse= 855 1.00D-06 EigRej= 5.69D-07 NBFU= 855
converged: NO NO NO NO
hfenergy: -1479.2118779 hartree
pointgroup: C01 [X(C32H35N3O1)]
dipole: -4.5890021 -0.8981042 -0.979938 debye
InChI: InChI=1/32C.3N.O.35H
charge 2 multiplicity 1
71 atoms
C  -0.22292009 -3.12578824 0.94935947
C  -1.51903998 -3.56799977 0.54817621
C  -2.6409666 -3.29759523 1.36469717
C  -2.43538352 -2.70763177 2.60621137
C  -1.14491223 -2.34044896 3.00533585
C  -0.01669568 -2.52788145 2.18014139
C  -0.03390701 -4.12037663 -1.06146691
C  -1.39400479 -4.21417709 -0.71890962
H  -3.63981116 -3.54455347 1.02629367
H  -3.27587837 -2.51999978 3.26363278
H  -0.99918284 -1.88386857 3.97759175
H  0.96798726 -2.22642304 2.50614627
N  0.66493748 -3.4422835 -0.08327868
H  0.4465372 -4.49299999 -1.95166962
C  2.02541176 -3.0319828 -0.12916433
O  2.50708763 -2.49611891 0.8455339
C  2.78087799 -3.21819797 -1.42005425
H  3.82664085 -3.32816661 -1.13071389
H  2.4883432 -4.12206846 -1.95790193
C  2.63992233 -1.96980931 -2.3285013
H  3.37467453 -2.08080447 -3.13223248
H  2.91879861 -1.07979961 -1.75504362
C  1.26903171 -1.80250765 -2.92112334
H  0.97988658 -2.53171165 -3.67774942
C  0.41175119 -0.83709062 -2.58437216
H  0.66837786 -0.08553824 -1.84130419
H  -0.56667275 -0.76248002 -3.04844778
C  -2.45353379 -4.7531303 -1.50176804
H  -2.38246297 -4.78558411 -2.58285314
N  -3.55765344 -5.30213947 -0.92919466
H  -3.49947249 -5.59374999 0.04068113
C  -5.74164414 -5.63546706 1.557711
C  -5.75624108 -6.52197654 0.47664073
C  -5.61756365 -7.89339172 0.71865491
C  -5.44863126 -8.36311104 2.01721456
C  -5.40810281 -7.46974614 3.08701892
C  -5.55845021 -6.10456219 2.85681533
H  -5.88975422 -4.57242816 1.38652279
H  -5.63939702 -8.60764852 -0.09845642
H  -5.34479385 -9.42856298 2.19215991
H  -5.27109067 -7.83908428 4.09781901
H  -5.54500387 -5.40449753 3.68526991
C  -5.8925607 -5.95080704 -0.91856766
H  -6.20414393 -4.90577515 -0.83742012
C  -4.56042509 -5.97261932 -1.7367535
H  -4.71040391 -5.34733445 -2.62241639
C  -4.11896602 -7.35370797 -2.21028943
C  -4.52898867 -7.81578761 -3.46325704
C  -3.29806216 -8.16774002 -1.42295724
C  -4.1653235 -9.08666158 -3.9062843
H  -5.10665172 -7.17193205 -4.12198263
C  -2.92816704 -9.43234624 -1.86784636
H  -2.94099219 -7.81823925 -0.46064744
C  -3.36813092 -9.90036897 -3.104416
H  -4.48602259 -9.4291043 -4.8832582
H  -2.28856527 -10.05221541 -1.24811112
H  -3.07529365 -10.88602706 -3.45083504
C  -8.26650994 -6.85060575 -0.88376672
C  -7.41999126 -5.87697834 -2.96195613
C  -9.3849975 -6.74283411 -1.90396271
H  -8.31917997 -6.04589703 -0.14835768
H  -8.19331666 -7.80481392 -0.36655391
C  -8.90880841 -5.59270636 -2.78857799
H  -7.23341175 -6.53978199 -3.80632284
H  -6.81025738 -4.98115636 -3.06700238
H  -9.48054797 -7.66952574 -2.47819536
H  -10.33927902 -6.54273394 -1.41527624
H  -9.4109356 -5.55270594 -3.75572799
H  -9.06003023 -4.63456984 -2.28361992
N  -6.99621377 -6.62716203 -1.69544507
H  -6.64767686 -7.54572435 -1.98781298
