program: Gaussian 16
title: Title Card Required
version: ES64L-G16RevC.02
basis: 6-31+G(d,p)
method: UwB97XD TD-FC
operation: Force
keyword: #p
keyword: td=(nstates=30,root=2)
keyword: uwb97xd/6-31+g(d,p)
keyword: force
keyword: scrf=(CPCM,solvent=chloroform)
keyword: nosymm
keyword: scf=xqc
keyword: Guess=mix
keyword: density=current
title: #p td=(nstates=30,root=2) uwb97xd/6-31+g(d,p) force scrf=(CPCM,solvent
basis: NPDir=0 NMtPBC= 1 NCelOv= 1 NCel= 1 NClECP= 1 NCelD= 1
basis: NCelK= 1 NCelE2= 1 NClLst= 1 CellRange= 0.0.
basis: One-electron integrals computed using PRISM.
basis: NBasis= 859 RedAO= T EigKep= 1.05D-06 NBF= 859
basis: NBsUse= 855 1.00D-06 EigRej= 5.63D-07 NBFU= 855
converged: NO NO NO NO
hfenergy: -1479.2122027 hartree
pointgroup: C01 [X(C32H35N3O1)]
dipole: -3.8052141 -0.2580434 -0.4410381 debye
InChI: InChI=1/32C.3N.O.35H
charge 2 multiplicity 1
71 atoms
C  -0.22372125 -3.12374738 0.94754879
C  -1.51993287 -3.56603297 0.54666638
C  -2.64011812 -3.30232106 1.36405754
C  -2.43576428 -2.71264194 2.60598358
C  -1.14766876 -2.34094955 3.00107449
C  -0.01637078 -2.5279172 2.17706017
C  -0.03338719 -4.1187001 -1.06060368
C  -1.3944196 -4.21797978 -0.71604029
H  -3.64044728 -3.54513454 1.02455323
H  -3.27725963 -2.53073841 3.26394361
H  -1.00152476 -1.89237639 3.97769728
H  0.96781052 -2.23047998 2.50722799
N  0.66497432 -3.44198144 -0.08491521
H  0.44373785 -4.47180519 -1.95952886
C  2.02442091 -3.03144873 -0.13280298
O  2.50469684 -2.49916443 0.84614483
C  2.78126795 -3.21547105 -1.42050973
H  3.82778199 -3.32577261 -1.13106438
H  2.48910316 -4.12104237 -1.95685104
C  2.64118798 -1.96784649 -2.33028184
H  3.37635097 -2.07896023 -3.13402582
H  2.91975067 -1.07801099 -1.75695419
C  1.27008623 -1.80097022 -2.92258565
H  0.98153001 -2.52998252 -3.68031531
C  0.41254056 -0.83723839 -2.58530172
H  0.66876302 -0.08512565 -1.8421503
H  -0.56571379 -0.76169605 -3.05042048
C  -2.44639961 -4.76948135 -1.49856935
H  -2.35655132 -4.83236471 -2.57624685
N  -3.56161791 -5.29872529 -0.92603723
H  -3.51183553 -5.57459457 0.04831554
C  -5.74182604 -5.63473157 1.5575173
C  -5.75756416 -6.52171799 0.47686722
C  -5.61764773 -7.89294481 0.71819669
C  -5.44822886 -8.36258283 2.01654623
C  -5.40795165 -7.46918989 3.08637298
C  -5.5578767 -6.10399035 2.85636792
H  -5.89041702 -4.57167401 1.38663376
H  -5.63911035 -8.60672346 -0.0992828
H  -5.34487916 -9.42817434 2.19109425
H  -5.27139314 -7.83884196 4.0969037
H  -5.54512348 -5.4039982 3.68502028
C  -5.89423175 -5.95106476 -0.91753547
H  -6.20481125 -4.90605387 -0.83806324
C  -4.55995817 -5.9711758 -1.7331038
H  -4.70931285 -5.34655274 -2.61924607
C  -4.12086226 -7.35245792 -2.20799241
C  -4.53024112 -7.81328848 -3.46304244
C  -3.29971743 -8.16539497 -1.42198402
C  -4.16504461 -9.08453999 -3.90614726
H  -5.1054581 -7.1671869 -4.12153754
C  -2.92748477 -9.4297778 -1.86600517
H  -2.94207532 -7.81125794 -0.46065921
C  -3.36797447 -9.89717076 -3.103542
H  -4.48656286 -9.42791024 -4.88355021
H  -2.28811104 -10.04811729 -1.24457156
H  -3.07582151 -10.88364985 -3.44697675
C  -8.26700485 -6.85089812 -0.88406452
C  -7.42051525 -5.87710696 -2.96224713
C  -9.38559962 -6.7432069 -1.90397378
H  -8.31965061 -6.04615246 -0.14852386
H  -8.19338311 -7.80518392 -0.36675205
C  -8.90939961 -5.59286107 -2.78883521
H  -7.23396722 -6.54002082 -3.80648012
H  -6.8111377 -4.98118599 -3.06764755
H  -9.48089137 -7.66992396 -2.47831921
H  -10.33989181 -6.54293001 -1.41516315
H  -9.4117863 -5.55290689 -3.75596561
H  -9.06048119 -4.63473101 -2.28374552
N  -6.99698582 -6.62750726 -1.69581718
H  -6.64764805 -7.54576028 -1.98801211
