program: Gaussian 16
title: Title Card Required
version: ES64L-G16RevC.02
basis: 6-31+G(d,p)
method: UwB97XD TD-FC
operation: Force
keyword: #p
keyword: td=(nstates=30,root=3)
keyword: uwb97xd/6-31+g(d,p)
keyword: force
keyword: scrf=(CPCM,solvent=chloroform)
keyword: nosymm
keyword: scf=xqc
keyword: Guess=mix
keyword: density=current
title: #p td=(nstates=30,root=3) uwb97xd/6-31+g(d,p) force scrf=(CPCM,solvent
basis: NPDir=0 NMtPBC= 1 NCelOv= 1 NCel= 1 NClECP= 1 NCelD= 1
basis: NCelK= 1 NCelE2= 1 NClLst= 1 CellRange= 0.0.
basis: One-electron integrals computed using PRISM.
basis: NBasis= 859 RedAO= T EigKep= 1.05D-06 NBF= 859
basis: NBsUse= 855 1.00D-06 EigRej= 5.66D-07 NBFU= 855
converged: NO NO NO NO
hfenergy: -1479.2120814 hartree
pointgroup: C01 [X(C32H35N3O1)]
dipole: -4.6043871 -0.8969439 -0.9650253 debye
InChI: InChI=1/32C.3N.O.35H
charge 2 multiplicity 1
71 atoms
C  -0.22351221 -3.12367052 0.9471197
C  -1.51972313 -3.56463542 0.54540716
C  -2.64198739 -3.3040335 1.36419171
C  -2.43543758 -2.71185192 2.60506539
C  -1.14667562 -2.33964794 3.00065292
C  -0.01711924 -2.52682225 2.17611348
C  -0.03319241 -4.12319152 -1.05849752
C  -1.39452193 -4.2196117 -0.71439631
H  -3.6395523 -3.54538634 1.02414994
H  -3.27662138 -2.53361038 3.2629433
H  -1.00216695 -1.89512101 3.97728786
H  0.96819134 -2.23131707 2.50818509
N  0.66474424 -3.44144069 -0.08549726
H  0.44284162 -4.46718166 -1.96024014
C  2.02318809 -3.03107039 -0.13352878
O  2.50365376 -2.50028612 0.84582957
C  2.78141862 -3.21462135 -1.42099866
H  3.8282746 -3.32537778 -1.1310364
H  2.48906964 -4.12081975 -1.95622024
C  2.64155399 -1.96762091 -2.33063749
H  3.37659818 -2.07864868 -3.13412666
H  2.91998479 -1.07757212 -1.75729661
C  1.27007742 -1.80082954 -2.92265432
H  0.9818561 -2.52962298 -3.6807664
C  0.41264308 -0.83739471 -2.58532628
H  0.66886315 -0.08503296 -1.84235883
H  -0.56546334 -0.76152242 -3.05079962
C  -2.44780855 -4.76893908 -1.49770975
H  -2.35178802 -4.83822849 -2.5761782
N  -3.56058342 -5.29814455 -0.92509156
H  -3.51266528 -5.5711797 0.0501579
C  -5.74174349 -5.63459543 1.55743953
C  -5.75796428 -6.52179263 0.47702751
C  -5.61757316 -7.89282766 0.71821191
C  -5.44813521 -8.36247054 2.01643875
C  -5.40796613 -7.4690246 3.08624681
C  -5.55773323 -6.10389261 2.85627127
H  -5.89055419 -4.5714622 1.38669154
H  -5.63904767 -8.60654841 -0.0995533
H  -5.34492995 -9.42802562 2.19079524
H  -5.27145475 -7.83879898 4.09660992
H  -5.54517291 -5.40394446 3.68491955
C  -5.89463595 -5.95145054 -0.9172951
H  -6.20430674 -4.90648308 -0.83843767
C  -4.56065598 -5.97170015 -1.73253441
H  -4.70819871 -5.34670184 -2.61751033
C  -4.12168888 -7.35305113 -2.20743019
C  -4.53089924 -7.8131379 -3.46344725
C  -3.30032338 -8.16521472 -1.42182998
C  -4.16488698 -9.08419186 -3.90634703
H  -5.10525329 -7.1661993 -4.12160547
C  -2.92695715 -9.42955932 -1.86536658
H  -2.94247057 -7.80969348 -0.46120079
C  -3.3681507 -9.89639858 -3.1038743
H  -4.48685133 -9.42808948 -4.88434181
H  -2.28789809 -10.04734196 -1.24362209
H  -3.07584526 -10.88343563 -3.44611905
C  -8.2672128 -6.85099299 -0.88407658
C  -7.42065407 -5.87712345 -2.96230382
C  -9.38576656 -6.7431734 -1.90408169
H  -8.31971104 -6.04615988 -0.14853301
H  -8.193318 -7.80524647 -0.36680233
C  -8.90957873 -5.59290106 -2.78887391
H  -7.23406026 -6.54007858 -3.80652052
H  -6.81126449 -4.9810989 -3.0678099
H  -9.48092518 -7.6700154 -2.47833067
H  -10.3399398 -6.54296692 -1.41511984
H  -9.4119364 -5.55294607 -3.75598646
H  -9.060549 -4.63476384 -2.28376725
N  -6.99714019 -6.62749795 -1.69580724
H  -6.64754411 -7.54581546 -1.98806455
