program: Gaussian 16
title: Title Card Required
version: ES64L-G16RevC.02
basis: 6-31+G(d,p)
method: UwB97XD TD-FC
operation: Force
keyword: #p
keyword: td=(nstates=30,root=3)
keyword: uwb97xd/6-31+g(d,p)
keyword: force
keyword: scrf=(CPCM,solvent=chloroform)
keyword: nosymm
keyword: scf=xqc
keyword: Guess=mix
keyword: density=current
title: #p td=(nstates=30,root=3) uwb97xd/6-31+g(d,p) force scrf=(CPCM,solvent
basis: NPDir=0 NMtPBC= 1 NCelOv= 1 NCel= 1 NClECP= 1 NCelD= 1
basis: NCelK= 1 NCelE2= 1 NClLst= 1 CellRange= 0.0.
basis: One-electron integrals computed using PRISM.
basis: NBasis= 859 RedAO= T EigKep= 1.07D-06 NBF= 859
basis: NBsUse= 855 1.00D-06 EigRej= 5.29D-07 NBFU= 855
converged: NO NO NO NO
hfenergy: -1479.2132029 hartree
pointgroup: C01 [X(C32H35N3O1)]
dipole: -3.8691857 -0.4344886 -0.7032601 debye
InChI: InChI=1/32C.3N.O.35H
charge 2 multiplicity 1
71 atoms
C  -0.22543 -3.128832 0.947925
C  -1.51573 -3.580236 0.547195
C  -2.642603 -3.318384 1.376019
C  -2.441814 -2.736441 2.618076
C  -1.155907 -2.361403 3.006886
C  -0.020656 -2.545772 2.172971
C  -0.031014 -4.076189 -1.077628
C  -1.396115 -4.192624 -0.730969
H  -3.643609 -3.533338 1.022366
H  -3.283764 -2.539526 3.270004
H  -1.007932 -1.88809 3.97099
H  0.961175 -2.237411 2.500962
N  0.668866 -3.423162 -0.099113
H  0.444597 -4.429967 -1.977718
C  2.02684 -3.026001 -0.134573
O  2.513012 -2.503743 0.848142
C  2.785314 -3.213009 -1.422522
H  3.83216 -3.323814 -1.135101
H  2.49268 -4.119283 -1.957354
C  2.642956 -1.966321 -2.332715
H  3.377908 -2.076724 -3.136395
H  2.920342 -1.076916 -1.758034
C  1.272404 -1.798922 -2.925916
H  0.983824 -2.527028 -3.684279
C  0.413876 -0.835343 -2.588432
H  0.668671 -0.084913 -1.843322
H  -0.564516 -0.760727 -3.053066
C  -2.413777 -4.845706 -1.485035
H  -2.305099 -4.965664 -2.557097
N  -3.574269 -5.277707 -0.925926
H  -3.558955 -5.545212 0.053783
C  -5.741156 -5.633865 1.556938
C  -5.756712 -6.520376 0.475488
C  -5.616744 -7.891801 0.716977
C  -5.447979 -8.36142 2.015362
C  -5.407863 -7.468414 3.085646
C  -5.557624 -6.103347 2.855836
H  -5.891161 -4.570899 1.386821
H  -5.638884 -8.606335 -0.099904
H  -5.345255 -9.426913 2.190171
H  -5.271656 -7.838415 4.096181
H  -5.545522 -5.403633 3.684603
C  -5.89804 -5.948169 -0.918425
H  -6.214751 -4.905079 -0.835875
C  -4.565733 -5.961579 -1.73602
H  -4.719537 -5.342484 -2.625911
C  -4.116866 -7.34292 -2.204444
C  -4.525998 -7.804564 -3.459152
C  -3.296216 -8.155861 -1.417193
C  -4.164046 -9.076581 -3.900862
H  -5.102256 -7.159472 -4.117204
C  -2.926175 -9.421373 -1.861294
H  -2.939423 -7.806517 -0.453664
C  -3.368065 -9.889453 -3.098562
H  -4.489698 -9.420161 -4.876891
H  -2.289662 -10.042592 -1.240082
H  -3.078136 -10.876878 -3.441695
C  -8.267599 -6.851221 -0.884278
C  -7.421619 -5.877486 -2.963028
C  -9.386143 -6.743566 -1.904176
H  -8.31999 -6.046462 -0.148696
H  -8.193308 -7.805396 -0.367033
C  -8.910221 -5.593374 -2.78912
H  -7.234481 -6.540466 -3.807077
H  -6.812616 -4.981258 -3.06839
H  -9.481238 -7.670369 -2.478284
H  -10.34019 -6.543361 -1.415139
H  -9.412569 -5.55332 -3.756164
H  -9.060777 -4.635181 -2.284037
N  -6.997796 -6.627233 -1.696221
H  -6.646488 -7.545044 -1.987524
