program: Gaussian 09
title: 000049721
version: EM64L-G09RevD.01
frameworkgroup: C1[X(C12H17N3O)]
method: RPBEPBE
basis: SDD
operation: Freq
keyword: #p
keyword: freq=noraman
keyword: PBEPBE/SDD
title: #p freq=noraman PBEPBE/SDD
converged: NO YES NO NO
title: Mulliken charges:
elementType: O N N N C C C C C C C C C C C C H H H H H H H H H H H H H H H H H
charge: -0.185443 0.057325 -0.015414 -0.044007 0.212383 -0.067906 -0.713333 -0.713300 -0.701483 -0.195712 0.219301 0.021335 0.043842 -0.392820 -0.683605 -0.683623 0.215052 0.216174 0.244430 0.216453 0.244215 0.216289 0.216560 0.201511 0.224932 0.225031 0.260002 0.238640 0.220423 0.221838 0.221843 0.220415 0.238654
chargesum: 0.00000
title: Mulliken charges with hydrogens summed into heavy atoms:
elementType: O N N N C C C C C C C C C C C C
charge: -0.185443 0.057325 -0.015414 -0.044007 0.212383 -0.067906 -0.036277 -0.036236 -0.050010 0.019340 0.219301 0.021335 0.043842 -0.132819 -0.002703 -0.002711
polarizability: 2.22150997e+02 -4.97617885e+00 1.38673617e+02 1.63351803e-02 -3.77683737e-03 1.05536465e+02
1716.lowfreq: -26.6691 -13.2042 -7.4246 -3.0415 -0.0005 -0.0005 0.0004 28.8265 53.0207
frequency: -26.6654 28.7743 52.9879 107.2481 128.1792 190.5017 193.2005 208.2383 216.2349 227.0620 227.7682 254.5682 262.2657 269.0617 294.2153 326.0896 330.9647 382.8707 387.3587 412.0953 440.1236 459.9487 516.2389 546.3573 565.4478 631.9859 655.4243 732.3780 742.3881 753.2900 778.4513 822.0319 822.6214 875.0080 889.1459 923.7889 926.7645 935.4601 939.8102 949.3457 959.4301 1020.4000 1021.7931 1024.7176 1090.0382 1114.7270 1139.1899 1169.3079 1200.5540 1205.7250 1211.6118 1253.9918 1268.4978 1297.9147 1303.6765 1349.0726 1355.1426 1364.1986 1374.8933 1380.1727 1392.0665 1402.6249 1416.1117 1434.4308 1451.7766 1463.8870 1465.0973 1469.5543 1470.4702 1474.3144 1476.0317 1478.8547 1490.6891 1500.4807 1533.5251 1564.9499 2979.2542 2981.0438 2986.8477 2987.7533 2990.4226 2993.1374 3074.1624 3077.5901 3083.1505 3086.8647 3087.2926 3093.3875 3093.4424 3098.8428 3098.9436 3099.3336 3132.4310
redmass: 2.9486 3.2571 3.8519 3.4836 3.7309 3.1065 1.6055 2.3405 1.1158 2.1759 2.1072 1.3175 1.0507 1.1271 2.8252 2.6336 3.1819 3.1950 2.8172 6.6284 3.0456 3.5664 4.4046 4.4700 5.2660 3.8121 8.7151 6.9962 7.8639 10.2099 6.8131 3.6023 8.4130 2.9291 4.1126 1.1548 1.7543 1.5931 1.4860 1.2052 1.4907 1.4124 1.9052 2.4014 1.6493 2.5890 2.9113 2.3352 2.8482 3.5477 3.2528 5.1819 3.4709 1.3269 3.1874 1.9789 2.2568 1.1803 1.2928 1.1862 1.5544 1.3290 2.4273 4.1816 1.0499 1.0533 1.0440 1.0471 1.0485 1.0508 1.0564 1.0494 1.0923 1.1017 9.4524 7.5195 1.0343 1.0349 1.0348 1.0391 1.0360 1.0802 1.1007 1.0998 1.1007 1.1000 1.0994 1.1009 1.1013 1.0995 1.0997 1.1003 1.0933
irintensity: 0.2581 0.2247 0.2227 1.1268 0.3926 0.6959 1.4114 2.5807 0.1192 0.1402 0.4937 0.0336 0.1311 0.0086 1.0425 1.4425 1.6511 0.0112 0.3584 0.1069 1.2811 1.9748 1.0604 5.8943 6.2717 3.7248 0.7920 3.6105 0.3481 5.3642 36.8193 0.8583 4.5072 2.8404 50.9144 3.7181 2.4783 4.6240 7.8859 0.1359 0.4460 0.7147 8.1320 1.1213 17.4381 1.6712 140.2840 3.5858 5.2232 14.0745 18.8264 6.9510 41.1104 0.2345 12.2107 24.6968 29.6837 18.8053 17.2416 16.4456 43.1156 21.5924 38.6764 10.3248 0.0002 1.1792 6.6591 0.2987 2.5546 13.8722 17.1905 14.7599 19.0120 44.0010 38.9331 180.5203 35.8584 21.8855 29.5806 29.0448 34.3332 13.3609 14.2668 20.8209 16.7237 79.0395 45.9650 0.5428 4.9665 35.7721 38.8405 38.0498 12.4065
temp: 298.150 k
press: 1.00000 atm
elementType: 8 7 7 7 6 6 6 6 6 6 6 6 6 6 6 6 1 1 1 1 1 1 1 1 1 1 1 1 1 1 1 1 1
symmnumber: 1
zpe: 711416.3 jmol-1
zpe.correction: 0.270964 hartree
zpe.thermalcorrener: 0.286457 hartree
zpe.thermalcorrenthalpy: 0.287401 hartree
zpe.thermalcorrgfe: 0.228859 hartree
zpe.sumelectzpe: -705.707538 hartree
zpe.sumelectthermal: -705.692045 hartree
zpe.sumelectthermalent: -705.691101 hartree
zpe.sumelectthermalfe: -705.749643 hartree
dipole: -1.1675 -3.7666 -0.0001
dipole: 3.9434
quadrupole: -86.1729 -105.5780 -95.4548
quadrupole: 8.5950 -0.0012 0.0031
quadrupole: 9.5623 -9.8427 0.2804 8.5950 -0.0012 0.0031
hfenergy: -705.9785019 hartree
pointgroup: C01 [X(C12H17N3O1)]
dipole: 0.4373987 -1.4885044 -0.0010668 debye
polarizability: 222.27967|3.7419972|138.5448931|0.0538364|0.0323681|105.5365154 unknown
InChI: InChI=1S/C12H17N3O/c1-7(2)9-8-6-13-11(12(3,4)5)14-10(8)16-15-9/h6-7H,1-5H3
charge 0 multiplicity 1
33 atoms
O  1.073896 2.031043 0.001493
N  -1.157445 1.097947 -0.000919
N  -1.248844 -1.347789 -0.003403
N  2.451449 1.444244 0.001405
C  -3.371163 -0.068668 -0.001688
C  -1.840772 -0.092887 -0.003396
C  -3.866631 -0.827524 1.266943
C  -3.869646 -0.819474 -1.273917
C  -3.911285 1.379594 0.00351
C  3.520861 -0.801878 -0.000503
C  2.300784 0.103268 -0.000128
C  0.901603 -0.265726 -0.001188
C  0.179477 0.958532 -0.000234
C  0.105493 -1.437152 -0.002651
C  4.369451 -0.590404 1.281743
C  4.371133 -0.587072 -1.281068
H  3.146701 -1.844822 -0.002091
H  -4.970872 -0.872418 1.261833
H  -3.468339 -1.856017 1.28634
H  -3.548896 -0.307424 2.189248
H  -3.47175 -1.847927 -1.30059
H  -4.973891 -0.863933 -1.266638
H  -3.55373 -0.293732 -2.193646
H  -5.016621 1.357901 0.004687
H  -3.568062 1.93462 0.893243
H  -3.570087 1.94018 -0.883522
H  0.534918 -2.445132 -0.003256
H  4.759733 0.441399 1.317938
H  5.224574 -1.28974 1.290464
H  3.772782 -0.762827 2.19534
H  3.775762 -0.757495 -2.195886
H  5.226486 -1.286124 -1.290299
H  4.761132 0.444939 -1.314265
