program: Gaussian 16
title: Title Card Required
version: ES64L-G16RevC.02
basis: 6-31+G(d,p)
method: UwB97XD TD-FC
operation: Force
keyword: #p
keyword: td=(nstates=30,root=3)
keyword: uwb97xd/6-31+g(d,p)
keyword: force
keyword: scrf=(CPCM,solvent=chloroform)
keyword: nosymm
keyword: scf=xqc
keyword: Guess=mix
keyword: density=current
title: #p td=(nstates=30,root=3) uwb97xd/6-31+g(d,p) force scrf=(CPCM,solvent
basis: NPDir=0 NMtPBC= 1 NCelOv= 1 NCel= 1 NClECP= 1 NCelD= 1
basis: NCelK= 1 NCelE2= 1 NClLst= 1 CellRange= 0.0.
basis: One-electron integrals computed using PRISM.
basis: NBasis= 859 RedAO= T EigKep= 1.06D-06 NBF= 859
basis: NBsUse= 853 1.00D-06 EigRej= 9.74D-07 NBFU= 853
converged: NO NO NO NO
hfenergy: -1479.2139817 hartree
pointgroup: C01 [X(C32H35N3O1)]
dipole: -5.0073723 -1.8272064 -4.2605942 debye
InChI: InChI=1/32C.3N.O.35H
charge 2 multiplicity 1
71 atoms
C  0.26397876 -1.93866091 -0.00845514
C  -0.92708287 -1.78392271 -0.77454762
C  -1.38195785 -0.46327565 -1.12693692
C  -0.60128524 0.62852262 -0.75533878
C  0.57063674 0.44411587 -0.02198187
C  1.02873836 -0.86206254 0.3761025
C  -0.60008649 -3.98714504 -0.36770941
C  -1.46434918 -3.07415244 -1.00374741
H  -2.31655224 -0.30988874 -1.65440377
H  -0.92136997 1.63069245 -1.0154446
H  1.15677202 1.30427866 0.280663
H  1.93146601 -0.97637137 0.95745707
N  0.43002422 -3.32403577 0.22939467
H  -0.6968055 -5.05941495 -0.32252274
C  1.5482153 -3.9095303 0.88115376
O  2.38337105 -3.1834593 1.37628061
C  1.67802696 -5.41044674 0.85915112
H  2.27599736 -5.66092046 1.73706147
H  0.71671804 -5.92006316 0.95936244
C  2.42747118 -5.88815672 -0.4123731
H  2.74174452 -6.91949506 -0.22347243
H  3.33607624 -5.28993864 -0.5342246
C  1.59740208 -5.84526566 -1.66433076
H  0.7991249 -6.58482215 -1.7341977
C  1.77415455 -4.9833967 -2.66707829
H  2.56249153 -4.23433598 -2.64001007
H  1.14109879 -5.0057782 -3.54875274
C  -2.68277068 -3.4132319 -1.67759537
H  -3.28719944 -4.25296979 -1.35191905
N  -3.09934726 -2.72387709 -2.744212
H  -2.49647639 -2.00321628 -3.12574317
C  -2.61449185 -0.41203075 -4.98870331
C  -3.92221253 -0.69979546 -4.58247699
C  -4.70775664 0.32339165 -4.03972476
C  -4.18653613 1.60488501 -3.89329786
C  -2.8735729 1.87760344 -4.27603784
C  -2.08801955 0.86824542 -4.8258153
H  -2.00237061 -1.18812645 -5.44174197
H  -5.72895563 0.13665181 -3.72289103
H  -4.80782973 2.39022403 -3.47658601
H  -2.47005114 2.87732805 -4.15649547
H  -1.07085995 1.075207 -5.14017866
C  -4.40503507 -2.13082042 -4.69420255
H  -3.72362048 -2.67792026 -5.35207671
C  -4.42501195 -2.88087235 -3.32172174
H  -4.56514647 -3.9480632 -3.52938241
C  -5.52994168 -2.44901248 -2.36619154
C  -6.74151996 -3.14615458 -2.36327435
C  -5.36057555 -1.38131147 -1.47972465
C  -7.78292421 -2.7549792 -1.52270883
H  -6.86865007 -4.02230193 -2.99335448
C  -6.39413515 -0.99639047 -0.63317093
H  -4.4191905 -0.84568599 -1.44506401
C  -7.61145553 -1.67630899 -0.659291
H  -8.71696582 -3.30605937 -1.53134653
H  -6.24688473 -0.16662601 0.04985484
H  -8.41584399 -1.37616551 0.00378217
C  -5.89172138 -1.35114476 -6.59357988
C  -6.12905403 -3.65363028 -5.79698929
C  -6.84896884 -2.11679441 -7.48811719
H  -4.9001335 -1.27181569 -7.04268827
H  -6.22688396 -0.36290525 -6.28574574
C  -6.3917472 -3.56169667 -7.29708195
H  -7.02611056 -3.93207423 -5.24523109
H  -5.32003543 -4.33313002 -5.53458679
H  -7.88289264 -1.98244832 -7.1558297
H  -6.77379818 -1.77611799 -8.5213479
H  -7.13676769 -4.29606148 -7.60480101
H  -5.47262509 -3.7497041 -7.85871697
N  -5.75224008 -2.23329107 -5.35889129
H  -6.45555908 -1.93014263 -4.6780401
