program: Gaussian 16
title: Title Card Required
version: ES64L-G16RevC.02
basis: 6-31+G(d,p)
method: UwB97XD TD-FC
operation: Force
keyword: #p
keyword: td=(nstates=30,root=2)
keyword: uwb97xd/6-31+g(d,p)
keyword: force
keyword: scrf=(CPCM,solvent=chloroform)
keyword: nosymm
keyword: scf=xqc
keyword: Guess=mix
keyword: density=current
title: #p td=(nstates=30,root=2) uwb97xd/6-31+g(d,p) force scrf=(CPCM,solvent
basis: NPDir=0 NMtPBC= 1 NCelOv= 1 NCel= 1 NClECP= 1 NCelD= 1
basis: NCelK= 1 NCelE2= 1 NClLst= 1 CellRange= 0.0.
basis: One-electron integrals computed using PRISM.
basis: NBasis= 859 RedAO= T EigKep= 1.02D-06 NBF= 859
basis: NBsUse= 854 1.00D-06 EigRej= 7.84D-07 NBFU= 854
converged: NO NO NO NO
hfenergy: -1479.2116237 hartree
pointgroup: C01 [X(C32H35N3O1)]
dipole: -5.2934294 -1.7421413 -4.1526978 debye
InChI: InChI=1/32C.3N.O.35H
charge 2 multiplicity 1
71 atoms
C  0.28783036 -1.91690875 -0.12272071
C  -0.9560291 -1.76064775 -0.79584241
C  -1.38412872 -0.44962545 -1.2250848
C  -0.50810405 0.62159095 -1.03841967
C  0.71944125 0.43280927 -0.41011688
C  1.14527717 -0.86016565 0.07866249
C  -0.68326418 -3.94504565 -0.26820635
C  -1.55481142 -3.03531975 -0.89654117
H  -2.36461117 -0.29139531 -1.66071444
H  -0.79750379 1.61334289 -1.36451457
H  1.38301557 1.27652321 -0.25965376
H  2.09690535 -0.97480988 0.57585913
N  0.4122032 -3.28930571 0.2049945
H  -0.81982057 -5.00702779 -0.14435839
C  1.54228229 -3.8720972 0.84333757
O  2.40913063 -3.14285958 1.2717517
C  1.64603356 -5.37410963 0.87999363
H  2.21234167 -5.60985596 1.78285303
H  0.67650291 -5.87002916 0.96055642
C  2.42573019 -5.8917679 -0.35515264
H  2.64719963 -6.94716755 -0.16936621
H  3.38357998 -5.36531884 -0.41458457
C  1.67362068 -5.75782896 -1.64950894
H  0.78536218 -6.38145171 -1.7552552
C  2.02253772 -4.94890203 -2.65034942
H  2.90766309 -4.31951227 -2.59029344
H  1.44459607 -4.90303997 -3.56812776
C  -2.82291016 -3.35893346 -1.49518228
H  -3.50023797 -4.0797291 -1.05070561
N  -3.1867268 -2.76472447 -2.63037805
H  -2.51788091 -2.14775946 -3.07848901
C  -2.58128414 -0.47813502 -4.88636518
C  -3.89402996 -0.73720467 -4.47835055
C  -4.64832913 0.29592233 -3.91108405
C  -4.08989523 1.5591826 -3.74241108
C  -2.77164789 1.80259389 -4.12749158
C  -2.01753624 0.78307042 -4.70130983
H  -1.99360729 -1.26214454 -5.35775818
H  -5.67423841 0.13162111 -3.59763791
H  -4.68673786 2.3537192 -3.30791354
H  -2.33955834 2.78814404 -3.99025379
H  -0.99571695 0.9662621 -5.01493766
C  -4.41438954 -2.15207657 -4.62184376
H  -3.73009363 -2.70413643 -5.2727513
C  -4.4888344 -2.9262221 -3.26183075
H  -4.6128222 -3.9905547 -3.49582298
C  -5.63786125 -2.5180054 -2.35042013
C  -6.84726652 -3.21541017 -2.43502775
C  -5.522688 -1.47024144 -1.43222652
C  -7.93999665 -2.84002264 -1.65537177
H  -6.93480666 -4.07776227 -3.08973275
C  -6.60935787 -1.10268762 -0.64498522
H  -4.5842545 -0.93715171 -1.32537901
C  -7.8236757 -1.77780371 -0.76284587
H  -8.87149093 -3.38966873 -1.73457574
H  -6.50685525 -0.28720709 0.06298838
H  -8.66916637 -1.48900845 -0.14757311
C  -5.85132846 -1.28045896 -6.52125333
C  -6.12138743 -3.61153756 -5.82843326
C  -6.80733216 -1.99483146 -7.45773336
H  -4.85238105 -1.20120211 -6.95350879
H  -6.17422491 -0.29988913 -6.17824877
C  -6.36466938 -3.45089148 -7.32633138
H  -7.02711534 -3.91095246 -5.30291067
H  -5.31800284 -4.3046356 -5.5839808
H  -7.84287647 -1.86514103 -7.12873951
H  -6.71950561 -1.60873408 -8.47376089
H  -7.11225091 -4.16384485 -7.67538907
H  -5.44066971 -3.62113421 -7.88558776
N  -5.74528426 -2.21341557 -5.32230064
H  -6.46192554 -1.93360236 -4.64519288
