program: Gaussian 16
title: Title Card Required
version: ES64L-G16RevC.02
basis: 6-31+G(d,p)
method: UwB97XD TD-FC
operation: Force
keyword: #p
keyword: td=(nstates=30,root=2)
keyword: uwb97xd/6-31+g(d,p)
keyword: force
keyword: scrf=(CPCM,solvent=chloroform)
keyword: nosymm
keyword: scf=xqc
keyword: Guess=mix
keyword: density=current
title: #p td=(nstates=30,root=2) uwb97xd/6-31+g(d,p) force scrf=(CPCM,solvent
basis: NPDir=0 NMtPBC= 1 NCelOv= 1 NCel= 1 NClECP= 1 NCelD= 1
basis: NCelK= 1 NCelE2= 1 NClLst= 1 CellRange= 0.0.
basis: One-electron integrals computed using PRISM.
basis: NBasis= 859 RedAO= T EigKep= 1.02D-06 NBF= 859
basis: NBsUse= 854 1.00D-06 EigRej= 7.94D-07 NBFU= 854
converged: NO NO NO NO
hfenergy: -1479.2119646 hartree
pointgroup: C01 [X(C32H35N3O1)]
dipole: -5.2651299 -1.7509633 -4.1707111 debye
InChI: InChI=1/32C.3N.O.35H
charge 2 multiplicity 1
71 atoms
C  0.28820995 -1.9182704 -0.11695345
C  -0.95308211 -1.76075831 -0.79282045
C  -1.38047759 -0.44803534 -1.21565903
C  -0.51072868 0.62610439 -1.01647848
C  0.71072555 0.43805581 -0.37706827
C  1.13746338 -0.85815767 0.10177076
C  -0.67870393 -3.94791541 -0.27543616
C  -1.55140337 -3.03642091 -0.89935405
H  -2.35736246 -0.28947923 -1.65843363
H  -0.80367467 1.6189142 -1.33898619
H  1.3680319 1.28447813 -0.2103119
H  2.08401282 -0.9746982 0.60734685
N  0.41536971 -3.29259047 0.20342416
H  -0.80965239 -5.01181034 -0.16242884
C  1.54106616 -3.87649981 0.84983079
O  2.3987937 -3.14647624 1.29486894
C  1.65009209 -5.37944929 0.87673511
H  2.21704053 -5.61991469 1.77727692
H  0.68127739 -5.87674072 0.95573008
C  2.42921613 -5.89239165 -0.3610625
H  2.65872671 -6.94670543 -0.17674994
H  3.38313694 -5.35869133 -0.42539161
C  1.66930341 -5.76460179 -1.65101759
H  0.78649963 -6.3971866 -1.75209089
C  2.00571069 -4.95452679 -2.65490375
H  2.88455455 -4.31565356 -2.59927399
H  1.42120261 -4.914368 -3.56881745
C  -2.81679509 -3.35911164 -1.5027587
H  -3.487131 -4.09488002 -1.07158333
N  -3.18184458 -2.75762434 -2.63441415
H  -2.51654151 -2.13291753 -3.07684723
C  -2.58347605 -0.473383 -4.89516237
C  -3.89642119 -0.73461482 -4.48807447
C  -4.6538343 0.29812214 -3.92436314
C  -4.09850391 1.5625366 -3.75679793
C  -2.78062028 1.80857573 -4.1415261
C  -2.02348016 0.78930042 -4.71266455
H  -1.99361667 -1.25713452 -5.36458311
H  -5.68019461 0.1320859 -3.61268966
H  -4.69718159 2.35654845 -3.32358155
H  -2.35133517 2.79541588 -4.00734193
H  -1.00227546 0.97532071 -5.0270855
C  -4.41379268 -2.15062948 -4.62669225
H  -3.72942368 -2.70340643 -5.27701971
C  -4.48416013 -2.92226649 -3.26483113
H  -4.60721389 -3.98707872 -3.49696348
C  -5.63103775 -2.5141561 -2.35085642
C  -6.8407648 -3.21170837 -2.42888326
C  -5.51110059 -1.46495044 -1.43505588
C  -7.93040771 -2.83223182 -1.64709405
H  -6.93023472 -4.07821108 -3.07811715
C  -6.59261241 -1.09711909 -0.64117965
H  -4.57210155 -0.93185927 -1.33557126
C  -7.80874856 -1.76988242 -0.75537305
H  -8.8640932 -3.37911356 -1.72361842
H  -6.48397507 -0.28484597 0.069542
H  -8.65210011 -1.47672907 -0.13950501
C  -5.85478492 -1.28585077 -6.52691677
C  -6.12086518 -3.61534779 -5.82700033
C  -6.8115803 -2.0039019 -7.45996089
H  -4.85659888 -1.20792582 -6.96121696
H  -6.17807492 -0.30432334 -6.18667451
C  -6.36747155 -3.45915335 -7.32503374
H  -7.02512297 -3.91430197 -5.29892253
H  -5.31577537 -4.30676948 -5.58283471
H  -7.84690629 -1.87447351 -7.12994198
H  -6.72484525 -1.62056844 -8.47727575
H  -7.11572564 -4.17364784 -7.66963279
H  -5.44488088 -3.63080297 -7.8863859
N  -5.74573851 -2.21537316 -5.32520581
H  -6.4618298 -1.93409266 -4.64789082
