program: Gaussian 16
title: Title Card Required
version: ES64L-G16RevC.02
basis: 6-31+G(d,p)
method: UwB97XD TD-FC
operation: Force
keyword: #p
keyword: td=(nstates=30,root=2)
keyword: uwb97xd/6-31+g(d,p)
keyword: force
keyword: scrf=(CPCM,solvent=chloroform)
keyword: nosymm
keyword: scf=xqc
keyword: Guess=mix
keyword: density=current
title: #p td=(nstates=30,root=2) uwb97xd/6-31+g(d,p) force scrf=(CPCM,solvent
basis: NPDir=0 NMtPBC= 1 NCelOv= 1 NCel= 1 NClECP= 1 NCelD= 1
basis: NCelK= 1 NCelE2= 1 NClLst= 1 CellRange= 0.0.
basis: One-electron integrals computed using PRISM.
basis: NBasis= 859 RedAO= T EigKep= 1.02D-06 NBF= 859
basis: NBsUse= 854 1.00D-06 EigRej= 7.96D-07 NBFU= 854
converged: NO NO NO NO
hfenergy: -1479.2119246 hartree
pointgroup: C01 [X(C32H35N3O1)]
dipole: -3.2911578 -0.1920963 -3.3380924 debye
InChI: InChI=1/32C.3N.O.35H
charge 2 multiplicity 1
71 atoms
C  0.28995724 -1.9185238 -0.11895139
C  -0.95346313 -1.75991732 -0.79263348
C  -1.37900995 -0.44738743 -1.21635855
C  -0.50869926 0.6261891 -1.01981653
C  0.713583 0.43817838 -0.38109198
C  1.13981092 -0.8580135 0.09838319
C  -0.67945675 -3.94647167 -0.27339892
C  -1.55380132 -3.03476656 -0.89553743
H  -2.35708197 -0.28749904 -1.65647363
H  -0.80141815 1.61865034 -1.34321052
H  1.36948022 1.28418849 -0.21443361
H  2.0865767 -0.97380818 0.60464942
N  0.41582082 -3.29228114 0.20135356
H  -0.8105779 -5.01071096 -0.1609145
C  1.54115005 -3.87593875 0.849951
O  2.3969341 -3.14501933 1.29698053
C  1.64997627 -5.37912235 0.87672302
H  2.2161249 -5.62070718 1.77814097
H  0.68078794 -5.87563973 0.95418551
C  2.43016627 -5.89179983 -0.36092031
H  2.65811876 -6.94684973 -0.17647848
H  3.38409355 -5.36022861 -0.42487163
C  1.67104279 -5.76501018 -1.6519313
H  0.78692067 -6.39449726 -1.75211596
C  2.0084759 -4.95424382 -2.65476746
H  2.88851612 -4.31817988 -2.59980038
H  1.42455582 -4.91332499 -3.56944184
C  -2.81937903 -3.35910934 -1.49986975
H  -3.49014367 -4.09392639 -1.06846939
N  -3.18387227 -2.75886276 -2.63302043
H  -2.51755389 -2.13497681 -3.07582461
C  -2.58323708 -0.47445432 -4.89394478
C  -3.89589039 -0.73518923 -4.48686957
C  -4.65336957 0.29802014 -3.92317305
C  -4.09763139 1.56203753 -3.75559298
C  -2.77955872 1.80755277 -4.14034782
C  -2.02268885 0.78849156 -4.71160183
H  -1.99327741 -1.2581637 -5.36328254
H  -5.67968293 0.13168444 -3.61202476
H  -4.69608422 2.35620251 -3.32216077
H  -2.35020653 2.79459106 -4.00635085
H  -1.00165709 0.97449936 -5.02649303
C  -4.41409675 -2.15097657 -4.62595353
H  -3.72953749 -2.70416154 -5.27513239
C  -4.48538514 -2.92288022 -3.26432436
H  -4.60869249 -3.98787565 -3.49706645
C  -5.63256541 -2.51481857 -2.35098849
C  -6.84162578 -3.21328985 -2.42874157
C  -5.5130574 -1.4659397 -1.43446409
C  -7.93252002 -2.83242324 -1.64907275
H  -6.93030577 -4.08043163 -3.07717457
C  -6.59453279 -1.09929693 -0.64021783
H  -4.57449954 -0.93135123 -1.33588616
C  -7.81130724 -1.77025558 -0.75708495
H  -8.86625845 -3.37783651 -1.72823236
H  -6.4867511 -0.2883418 0.07220472
H  -8.65542173 -1.47816361 -0.14157469
C  -5.85451481 -1.28513116 -6.52638568
C  -6.12053406 -3.61460977 -5.82770197
C  -6.81124184 -2.00251946 -7.45968372
H  -4.85638874 -1.20706946 -6.96082944
H  -6.17769749 -0.30364495 -6.18593531
C  -6.3673485 -3.45786944 -7.32541834
H  -7.02463279 -3.91427408 -5.29951035
H  -5.31554513 -4.30615163 -5.58397084
H  -7.84649455 -1.87330015 -7.12979747
H  -6.72484727 -1.61882017 -8.47665364
H  -7.11540565 -4.17204874 -7.67042863
H  -5.44502561 -3.62929303 -7.8872337
N  -5.74584365 -2.21499435 -5.32499572
H  -6.46214364 -1.93416385 -4.64777936
