program: Gaussian 16
title: Title Card Required
version: ES64L-G16RevC.02
basis: 6-31+G(d,p)
method: UwB97XD TD-FC
operation: Force
keyword: #p
keyword: td=(nstates=30,root=3)
keyword: uwb97xd/6-31+g(d,p)
keyword: force
keyword: scrf=(CPCM,solvent=chloroform)
keyword: nosymm
keyword: scf=xqc
keyword: Guess=mix
keyword: density=current
title: #p td=(nstates=30,root=3) uwb97xd/6-31+g(d,p) force scrf=(CPCM,solvent
basis: NPDir=0 NMtPBC= 1 NCelOv= 1 NCel= 1 NClECP= 1 NCelD= 1
basis: NCelK= 1 NCelE2= 1 NClLst= 1 CellRange= 0.0.
basis: One-electron integrals computed using PRISM.
basis: NBasis= 859 RedAO= T EigKep= 1.06D-06 NBF= 859
basis: NBsUse= 853 1.00D-06 EigRej= 9.75D-07 NBFU= 853
converged: NO NO NO NO
hfenergy: -1479.2140242 hartree
pointgroup: C01 [X(C32H35N3O1)]
dipole: -5.0050589 -1.8317057 -4.2615908 debye
InChI: InChI=1/32C.3N.O.35H
charge 2 multiplicity 1
71 atoms
C  0.26349032 -1.93863907 -0.0072926
C  -0.92638152 -1.78384564 -0.77487629
C  -1.38091282 -0.46303867 -1.12604641
C  -0.60137579 0.62912915 -0.7533295
C  0.56997125 0.44434314 -0.01955455
C  1.0279075 -0.86215365 0.37823503
C  -0.59944742 -3.98660618 -0.3686587
C  -1.46332141 -3.07417481 -1.0056246
H  -2.31601558 -0.3109086 -1.65238759
H  -0.92175424 1.63129578 -1.01369079
H  1.15641883 1.30428467 0.28273015
H  1.93047859 -0.97759771 0.95927859
N  0.42958748 -3.3237885 0.22997086
H  -0.69546447 -5.05857476 -0.32202132
C  1.54794871 -3.90917501 0.88117169
O  2.38255263 -3.18241081 1.37576532
C  1.67822931 -5.41021722 0.85912228
H  2.27570481 -5.66192737 1.73699676
H  0.71658411 -5.91912288 0.95948876
C  2.42751033 -5.88795009 -0.41271584
H  2.74198201 -6.91908545 -0.22333935
H  3.33633153 -5.29007803 -0.53501029
C  1.5971356 -5.84548264 -1.66462292
H  0.79942852 -6.58566347 -1.73437012
C  1.77279189 -4.98357701 -2.66743807
H  2.5604781 -4.2338479 -2.64013625
H  1.13933776 -5.00642145 -3.54895911
C  -2.68143575 -3.41503738 -1.67925864
H  -3.28544619 -4.25538699 -1.35389554
N  -3.09955519 -2.72500163 -2.74455032
H  -2.49562515 -2.00607612 -3.12727106
C  -2.61459316 -0.41190021 -4.98845775
C  -3.92219362 -0.69986646 -4.58226117
C  -4.7078147 0.3233298 -4.03966657
C  -4.18696146 1.60501302 -3.89388254
C  -2.87422344 1.87813544 -4.27707275
C  -2.08848256 0.86863412 -4.82622643
H  -2.00237875 -1.18798611 -5.44129777
H  -5.7288381 0.13639361 -3.72246428
H  -4.80820965 2.39025957 -3.47697318
H  -2.47086688 2.87800053 -4.15788733
H  -1.07133677 1.07553327 -5.14043917
C  -4.40499395 -2.13086245 -4.69446327
H  -3.72377654 -2.67762669 -5.35292497
C  -4.425172 -2.88104215 -3.3220026
H  -4.5659442 -3.9481696 -3.52990926
C  -5.52933221 -2.44822137 -2.36607735
C  -6.74076259 -3.14550146 -2.3628035
C  -5.36012254 -1.37999442 -1.48031063
C  -7.78207946 -2.75414503 -1.5223137
H  -6.86773751 -4.02179049 -2.99249575
C  -6.39324232 -0.99565465 -0.63292684
H  -4.41927473 -0.8431773 -1.44690531
C  -7.61033231 -1.6759682 -0.65839761
H  -8.71620696 -3.30486404 -1.53175226
H  -6.24600353 -0.16604646 0.05038816
H  -8.41447178 -1.3765402 0.00524687
C  -5.89202499 -1.35143205 -6.59430063
C  -6.12918356 -3.65365613 -5.79689522
C  -6.84938682 -2.11756698 -7.48845892
H  -4.90053609 -1.27177469 -7.04355528
H  -6.2274631 -0.36320247 -6.28681515
C  -6.39193187 -3.5622994 -7.29699126
H  -7.02615211 -3.93197703 -5.24491701
H  -5.31998821 -4.33288891 -5.53448649
H  -7.88334772 -1.98325909 -7.1561682
H  -6.77437922 -1.77731219 -8.52183991
H  -7.13682854 -4.29692748 -7.60441997
H  -5.47269916 -3.75027409 -7.85854004
N  -5.75224011 -2.23319284 -5.35929184
H  -6.45549053 -1.92971244 -4.67859272
