program: Gaussian 09
title: 000049722
version: EM64L-G09RevD.01
frameworkgroup: C1[X(C12H14O3)]
method: RPBEPBE
basis: SDD
operation: Freq
keyword: #pfreq=noraman
keyword: PBEPBE/SDD
title: #p freq=noraman PBEPBE/SDD
converged: YES YES NO NO
title: Mulliken charges:
elementType: O O O C C C C C C C C C C C C H H H H H H H H H H H H H H
charge: -0.221688 -0.435403 -0.476537 -0.188461 -0.474624 -0.461621 -0.429831 -0.426485 0.066253 0.377654 -0.463931 -0.375446 0.157499 -0.335943 0.138843 0.238087 0.207736 0.260827 0.223330 0.234243 0.212833 0.215347 0.223057 0.201090 0.261204 0.280471 0.226520 0.386105 0.378869
chargesum: 0.00000
title: Mulliken charges with hydrogens summed into heavy atoms:
elementType: O O O C C C C C C C C C C C C
charge: -0.221688 -0.049298 -0.097668 0.049625 -0.006061 -0.004047 -0.001651 -0.002339 0.066253 0.377654 -0.202726 -0.094974 0.157499 -0.109423 0.138843
polarizability: 2.05094134e+02 -4.96788159e+00 1.38977420e+02 4.69806703e+00 5.16660089e+00 8.17217264e+01
1716.lowfreq: -15.1914 -7.6434 -1.8775 0.0005 0.0009 0.0010 29.5594 39.4080 45.4355
frequency: 28.4184 38.5826 45.1763 104.6175 118.6778 176.9402 219.8926 231.6747 268.3625 282.1668 302.4660 312.0938 333.5214 391.7683 435.4764 456.0493 478.9590 533.6442 562.0650 569.2810 609.1956 625.0187 692.0330 722.6439 753.4937 763.0227 804.3522 814.4834 840.2735 865.0342 881.6709 901.9926 924.5408 929.5582 960.5386 962.8509 1007.7616 1020.9651 1055.3183 1069.5925 1084.7433 1136.9511 1141.1009 1156.9194 1181.5693 1186.5523 1210.2871 1230.6614 1240.6269 1266.9647 1274.3179 1283.3342 1295.6539 1297.6555 1307.1517 1313.5580 1347.9986 1403.6265 1458.3817 1466.9309 1470.1989 1473.0098 1487.3938 1499.8745 1565.3736 1606.4266 1624.8533 2986.3260 2991.1894 2996.8490 2999.0998 3013.8591 3050.6969 3059.0882 3068.2418 3083.5696 3123.7188 3169.4669 3175.6760 3531.1750 3618.7650
redmass: 4.2097 2.5361 3.5440 7.1977 3.9173 4.1077 3.1364 2.5771 4.7416 5.0814 2.2237 1.4425 5.1720 8.1059 2.9384 4.5787 1.1182 2.2162 4.6534 5.1511 2.9429 5.8429 3.8853 3.2658 2.8291 5.4092 1.6702 1.4899 3.0114 2.1953 1.6034 2.5198 3.7118 1.8296 1.4187 1.4977 1.7741 1.9436 2.1098 2.2238 2.9190 1.2152 1.2927 1.5472 1.6120 1.5889 1.4540 1.6157 1.5542 1.4547 2.1396 1.2518 1.3524 1.3119 1.4161 1.4815 1.7759 6.8751 3.1523 1.0855 1.0866 1.0857 1.1096 3.4429 8.3875 7.2549 6.9415 1.0616 1.0676 1.0640 1.0734 1.0669 1.0975 1.1022 1.1041 1.1042 1.0901 1.0936 1.0918 1.0650 1.0666
irintensity: 2.9725 0.8807 1.6892 0.1479 2.4960 0.9336 3.0275 4.2208 0.7741 8.2427 56.3077 118.8963 13.2462 2.1963 11.7776 5.4616 133.6687 1.9308 2.1563 1.8900 1.3237 39.8723 4.3439 0.0759 22.0554 43.4809 8.2220 32.9299 5.9385 2.2906 18.5621 11.4118 15.1063 3.5219 8.1177 9.5398 22.9260 39.6637 9.8614 237.7983 23.1752 7.5584 5.1323 9.7653 31.1346 118.7521 3.3873 57.8075 110.6890 12.6953 261.2347 37.7920 38.8443 1.9054 17.3871 16.5719 86.8905 6.7448 2.9563 2.8941 9.4837 13.4267 5.0765 49.4865 207.6418 5.9499 44.7284 37.4614 28.4532 18.0726 37.1086 41.3723 38.5868 28.9689 24.4246 60.0052 15.8333 6.2964 1.6563 83.2890 84.5474
temp: 298.150 k
press: 1.00000 atm
elementType: 8 8 8 6 6 6 6 6 6 6 6 6 6 6 6 1 1 1 1 1 1 1 1 1 1 1 1 1 1
symmnumber: 1
zpe: 615921.4 jmol-1
zpe.correction: 0.234592 hartree
zpe.thermalcorrener: 0.248552 hartree
zpe.thermalcorrenthalpy: 0.249496 hartree
zpe.thermalcorrgfe: 0.192565 hartree
zpe.sumelectzpe: -690.230515 hartree
zpe.sumelectthermal: -690.216555 hartree
zpe.sumelectthermalent: -690.215611 hartree
zpe.sumelectthermalfe: -690.272541 hartree
dipole: 3.5268 -0.6729 0.3569
dipole: 3.6082
quadrupole: -64.4734 -94.7458 -90.0843
quadrupole: 12.6099 3.0198 0.6931
quadrupole: 18.6278 -11.6447 -6.9831 12.6099 3.0198 0.6931
hfenergy: -690.4651066 hartree
pointgroup: C01 [X(C12H14O3)]
dipole: 1.3968171 -0.240301 0.0794134 debye
polarizability: 205.4116506|-3.5854682|138.8699793|-0.8814152|5.1685188|81.511651 unknown
InChI: InChI=1S/C12H14O3/c13-10-6-5-9(7-11(10)14)12(15)8-3-1-2-4-8/h5-8,13-14H,1-4H2
charge 0 multiplicity 1
29 atoms
O  -1.369027 2.162073 0.223459
O  2.821898 -2.228807 -0.411168
O  4.610761 -0.249528 0.002037
C  -2.016092 -0.147327 -0.223271
C  -3.4248 0.355587 -0.6720
C  -2.281246 -0.940148 1.106711
C  -4.470444 -0.4107 0.201623
C  -3.675613 -1.563629 0.869276
C  -0.991403 0.971287 -0.001861
C  0.475427 0.639248 -0.00404
C  0.965115 -0.679499 -0.215885
C  1.399545 1.696225 0.219179
C  2.346378 -0.930664 -0.204104
C  2.785815 1.450877 0.229585
C  3.255836 0.139115 0.017874
H  -1.622342 -0.861184 -0.971342
H  -3.574406 0.156851 -1.74836
H  -3.492928 1.446321 -0.520202
H  -2.327547 -0.230126 1.955326
H  -1.493815 -1.681979 1.328954
H  -5.328007 -0.777018 -0.3904
H  -4.873662 0.260313 0.983257
H  -4.14366 -1.927993 1.801766
H  -3.588796 -2.424337 0.177141
H  0.295391 -1.52551 -0.390384
H  1.00025 2.701621 0.381462
H  3.494225 2.271338 0.399896
H  3.814397 -2.220789 -0.371194
H  5.22005 0.512079 0.153466
