program: Gaussian 16
title: Title Card Required
version: ES64L-G16RevC.02
basis: 6-31+G(d,p)
method: UwB97XD TD-FC
operation: Force
keyword: #p
keyword: td=(nstates=30,root=2)
keyword: uwb97xd/6-31+g(d,p)
keyword: force
keyword: scrf=(CPCM,solvent=chloroform)
keyword: nosymm
keyword: scf=xqc
keyword: Guess=mix
keyword: density=current
title: #p td=(nstates=30,root=2) uwb97xd/6-31+g(d,p) force scrf=(CPCM,solvent
basis: NPDir=0 NMtPBC= 1 NCelOv= 1 NCel= 1 NClECP= 1 NCelD= 1
basis: NCelK= 1 NCelE2= 1 NClLst= 1 CellRange= 0.0.
basis: One-electron integrals computed using PRISM.
basis: NBasis= 859 RedAO= T EigKep= 1.02D-06 NBF= 859
basis: NBsUse= 854 1.00D-06 EigRej= 8.09D-07 NBFU= 854
converged: NO NO NO NO
hfenergy: -1479.2122634 hartree
pointgroup: C01 [X(C32H35N3O1)]
dipole: -5.2343347 -1.7472143 -4.1982025 debye
InChI: InChI=1/32C.3N.O.35H
charge 2 multiplicity 1
71 atoms
C  0.28488705 -1.92146 -0.0937557
C  -0.94799597 -1.76549857 -0.78890027
C  -1.3825702 -0.45122351 -1.19780834
C  -0.5258929 0.62398677 -0.96409998
C  0.68447605 0.43918171 -0.29907901
C  1.12032386 -0.85880294 0.16209668
C  -0.66055471 -3.95676906 -0.29924835
C  -1.53286855 -3.04504699 -0.92400541
H  -2.35496642 -0.29223541 -1.65371111
H  -0.82108291 1.61936347 -1.27467254
H  1.32082965 1.29167214 -0.09174957
H  2.06045865 -0.97133564 0.68298475
N  0.41891611 -3.29901681 0.20691139
H  -0.78896032 -5.02170522 -0.19345878
C  1.54124402 -3.88133515 0.85875484
O  2.38762236 -3.15140527 1.32493959
C  1.65675604 -5.38401866 0.86955533
H  2.22632061 -5.62918408 1.76683048
H  0.68975639 -5.88311457 0.94979643
C  2.43217203 -5.89197373 -0.37388877
H  2.68022164 -6.93995597 -0.18199111
H  3.37810114 -5.34623885 -0.45508538
C  1.65424374 -5.78533493 -1.65631645
H  0.78801073 -6.4415581 -1.74884042
C  1.9569421 -4.96256862 -2.65969191
H  2.82183377 -4.30488508 -2.61009488
H  1.35916667 -4.92844936 -3.56594226
C  -2.79267443 -3.37073163 -1.53714444
H  -3.45383895 -4.12489958 -1.12476869
N  -3.1665608 -2.75474942 -2.65807929
H  -2.52393355 -2.09057982 -3.07598687
C  -2.58945924 -0.4604975 -4.91540488
C  -3.90106684 -0.72859038 -4.50617171
C  -4.66462004 0.30318489 -3.94998249
C  -4.11828819 1.57205192 -3.78858825
C  -2.80008592 1.82398163 -4.17171909
C  -2.03830415 0.80763668 -4.73983259
H  -1.99562256 -1.2423602 -5.38152677
H  -5.69133692 0.13323233 -3.64027628
H  -4.72250888 2.36501777 -3.36220545
H  -2.37469928 2.81232333 -4.03434061
H  -1.019007 0.99908577 -5.05790079
C  -4.4115064 -2.14819279 -4.64064192
H  -3.7275242 -2.69939523 -5.29286868
C  -4.47336509 -2.91630583 -3.27749791
H  -4.60350216 -3.98212791 -3.50792823
C  -5.60852729 -2.50148462 -2.35243241
C  -6.81793115 -3.20161654 -2.41167226
C  -5.47808112 -1.44705885 -1.44462614
C  -7.90034314 -2.81390517 -1.623709
H  -6.91023669 -4.0762647 -3.04856369
C  -6.54818108 -1.07824208 -0.63589168
H  -4.53913969 -0.90930935 -1.36235716
C  -7.76629241 -1.74913441 -0.73623901
H  -8.83653218 -3.35615969 -1.69306
H  -6.42993863 -0.267692 0.07617626
H  -8.60340655 -1.45426932 -0.1128617
C  -5.861715 -1.2996865 -6.54176188
C  -6.12238412 -3.62450084 -5.82103127
C  -6.82002399 -2.02766438 -7.46602061
H  -4.86504851 -1.21973045 -6.97928541
H  -6.18821199 -0.31718626 -6.20764846
C  -6.37405838 -3.48108894 -7.31937761
H  -7.02406071 -3.91923504 -5.28618252
H  -5.31526961 -4.31259075 -5.57414345
H  -7.85482894 -1.89615773 -7.13489401
H  -6.73675739 -1.65320322 -8.48686467
H  -7.12130707 -4.19988508 -7.6578324
H  -5.45125827 -3.6549356 -7.87984328
N  -5.74622184 -2.21979506 -5.33316131
H  -6.45960037 -1.9346458 -4.65522111
