program: Gaussian 16
title: Title Card Required
version: ES64L-G16RevC.02
basis: 6-31+G(d,p)
method: UwB97XD TD-FC
operation: Force
keyword: #p
keyword: td=(nstates=30,root=2)
keyword: uwb97xd/6-31+g(d,p)
keyword: force
keyword: scrf=(CPCM,solvent=chloroform)
keyword: nosymm
keyword: scf=xqc
keyword: Guess=mix
keyword: density=current
title: #p td=(nstates=30,root=2) uwb97xd/6-31+g(d,p) force scrf=(CPCM,solvent
basis: NPDir=0 NMtPBC= 1 NCelOv= 1 NCel= 1 NClECP= 1 NCelD= 1
basis: NCelK= 1 NCelE2= 1 NClLst= 1 CellRange= 0.0.
basis: One-electron integrals computed using PRISM.
basis: NBasis= 859 RedAO= T EigKep= 1.02D-06 NBF= 859
basis: NBsUse= 854 1.00D-06 EigRej= 8.12D-07 NBFU= 854
converged: NO NO NO NO
hfenergy: -1479.2123359 hartree
pointgroup: C01[X(C32H35N3O1)]
dipole: -3.2950714 -0.1895463 -3.3325095 debye
InChI: InChI=1/32C.3N.O.35H
charge 2 multiplicity 1
71 atoms
C  0.28393677 -1.92308572 -0.09046518
C  -0.94762644 -1.76652798 -0.78883669
C  -1.38220986 -0.45191827 -1.194697
C  -0.52849059 0.62554692 -0.9567039
C  0.67954763 0.43953791 -0.28704881
C  1.1167973 -0.85763769 0.17196578
C  -0.6581563 -3.95935835 -0.30229149
C  -1.52994804 -3.04704944 -0.92864506
H  -2.35387319 -0.29446901 -1.65347052
H  -0.82411232 1.62248233 -1.26633059
H  1.31352588 1.29310025 -0.07455881
H  2.05700376 -0.97226623 0.69271312
N  0.41904455 -3.30050225 0.20781297
H  -0.78641046 -5.02486296 -0.19779117
C  1.54095322 -3.88231409 0.86017869
O  2.38612437 -3.15253388 1.3287889
C  1.65736903 -5.38525749 0.86837929
H  2.22876839 -5.62949672 1.76546436
H  0.69039761 -5.88436581 0.94863425
C  2.43293371 -5.89203224 -0.37549465
H  2.68313612 -6.93992654 -0.1823485
H  3.37683106 -5.34342535 -0.45997767
C  1.65239916 -5.78951839 -1.65698029
H  0.78802112 -6.44797702 -1.74820125
C  1.94912351 -4.96330945 -2.66009145
H  2.81289075 -4.30312858 -2.61160334
H  1.35010623 -4.93003203 -3.56571875
C  -2.78834446 -3.37395653 -1.54429131
H  -3.44941251 -4.12817485 -1.12969275
N  -3.1648057 -2.75268694 -2.6626076
H  -2.52497236 -2.08095093 -3.07465399
C  -2.59129301 -0.45863275 -4.9185297
C  -3.90116092 -0.72783685 -4.50970006
C  -4.66696761 0.30431522 -3.95379239
C  -4.12054815 1.57358163 -3.79356768
C  -2.80331232 1.82609744 -4.17557581
C  -2.03988215 0.81027147 -4.74397849
H  -1.99565876 -1.2400108 -5.38460749
H  -5.69280766 0.13375663 -3.64460001
H  -4.7266221 2.3663809 -3.36847882
H  -2.37793801 2.81475322 -4.0374142
H  -1.02174023 1.00280446 -5.06290034
C  -4.41165848 -2.1477864 -4.64327988
H  -3.72694159 -2.69834712 -5.29521336
C  -4.47167234 -2.91485564 -3.28006061
H  -4.60226168 -3.98204508 -3.5087644
C  -5.60553768 -2.49996108 -2.35365326
C  -6.81468073 -3.20023222 -2.40846564
C  -5.47217484 -1.44508551 -1.44568595
C  -7.89573842 -2.81174752 -1.61987555
H  -6.90695239 -4.07617991 -3.04497496
C  -6.54133408 -1.07552815 -0.634929
H  -4.53375647 -0.90682278 -1.36501749
C  -7.76025841 -1.74546489 -0.73390129
H  -8.83272292 -3.35373716 -1.68783781
H  -6.42142503 -0.26453621 0.07605547
H  -8.59617906 -1.45046281 -0.10873746
C  -5.8625279 -1.30169286 -6.54370561
C  -6.12253604 -3.62595527 -5.81999731
C  -6.82084209 -2.03111023 -7.46663548
H  -4.8659707 -1.2216052 -6.98171041
H  -6.18946296 -0.31919895 -6.21012589
C  -6.37499009 -3.48434872 -7.31825526
H  -7.02385034 -3.92008564 -5.28416395
H  -5.31539483 -4.31419536 -5.57293261
H  -7.85553515 -1.89912977 -7.13555438
H  -6.73834927 -1.65804569 -8.48790099
H  -7.12186081 -4.20366923 -7.65621747
H  -5.45238396 -3.65858318 -7.87859337
N  -5.74639243 -2.2205715 -5.33437218
H  -6.45909645 -1.93466992 -4.65562591
