program: Gaussian 09
title: 000049731
version: EM64L-G09RevD.01
frameworkgroup: C1[X(C15H24N2O2)]
method: RPBEPBE
basis: SDD
operation: Freq
keyword: #p
keyword: freq=noraman
keyword: PBEPBE/SDD
title: #p freq=noraman PBEPBE/SDD
converged: YES YES NO NO
title: Mulliken charges:
elementType: O O N N C C C C C C C C C C C C C C C H H H H H H H H H H H H H H H H H H H H H H H H
charge: -0.276072 -0.252575 -0.295767 -0.460978 -0.387986 -0.350340 -0.554099 -0.371026 0.203570 0.290796 0.326043 -0.563215 -0.268074 -0.351828 -0.393672 -0.670442 -0.238270 -0.254267 -0.495570 0.233857 0.225365 0.175010 0.205642 0.232197 0.210716 0.242718 0.202494 0.219995 0.313670 0.193964 0.233093 0.174617 0.207143 0.307587 0.228810 0.220403 0.235088 0.214044 0.227613 0.226290 0.201252 0.199639 0.232568
chargesum: 0.00000
title: Mulliken charges with hydrogens summed into heavy atoms:
elementType: O O N N C C C C C C C C C C C C C C C
charge: -0.276072 -0.252575 -0.053049 -0.147308 0.071236 0.030311 -0.111186 0.051464 0.203570 0.290796 0.326043 -0.136159 0.113686 -0.044241 -0.164862 -0.000907 -0.010656 -0.027977 0.137888
polarizability: 2.70298416e+02 5.78915521e+00 1.82471872e+02 -1.61917896e+01 5.34267037e+00 1.21646884e+02
1716.lowfreq: -8.6407 -1.8273 -0.0004 0.0007 0.0012 3.2083 12.6618 23.3977 25.8298
frequency: 12.3241 23.3497 25.7674 40.9818 53.9027 64.6596 84.0860 89.3943 102.5677 112.3599 130.6873 138.9311 148.7143 162.4851 169.7429 199.5191 222.3097 232.8007 271.7043 295.0857 326.7294 352.4506 358.5377 422.4209 459.2476 471.7051 493.1240 515.4882 561.0408 567.9062 624.8646 634.4999 685.5528 711.4800 749.1981 757.3936 767.5354 775.4879 790.9300 824.0719 829.3597 869.7905 887.9706 890.7221 935.4564 958.3228 965.0674 998.8327 1015.4170 1028.0241 1032.5810 1051.2328 1059.0979 1061.8527 1063.8109 1076.5216 1098.9886 1105.8325 1116.0282 1121.8272 1151.4198 1156.2175 1162.9068 1173.8248 1186.1448 1195.6522 1211.3531 1235.6601 1255.6471 1263.4665 1268.8408 1275.1274 1284.1605 1298.9983 1314.0887 1316.8076 1344.4206 1370.1966 1380.9931 1392.9289 1400.2876 1438.5918 1439.2075 1446.3624 1454.9834 1456.8947 1457.6181 1468.9141 1470.2776 1474.3590 1484.2405 1487.1901 1491.6364 1498.6345 1500.2265 1516.1167 1593.7314 1616.2571 1625.7284 2839.6405 2896.0765 2905.6080 2923.1939 2955.2308 2965.6660 2978.5012 2981.2868 2986.1509 2993.4712 2997.6027 3018.1349 3034.4934 3034.7615 3064.7044 3075.6313 3086.6724 3100.4737 3117.4399 3136.0562 3159.5112 3191.4480 3423.2177 3544.6445
redmass: 4.7958 4.2182 2.0040 3.8367 4.4392 3.2177 2.3692 2.5569 3.1686 3.2085 2.4618 3.3367 2.3778 3.9014 2.5458 1.2868 1.2751 3.0353 4.0870 4.0666 3.7664 4.0356 3.7853 2.8373 3.5289 3.3921 3.5977 3.3813 3.9389 3.4273 3.9892 1.2780 1.4754 3.3921 2.6755 1.3888 1.6227 2.0837 1.2548 1.4337 2.0617 1.5060 1.3625 4.8325 5.7935 1.3655 2.5428 1.3065 3.5290 1.7667 2.9474 2.0897 2.3496 1.8747 2.5851 2.5657 2.4442 1.7032 1.3916 1.5270 3.1854 1.4453 1.4603 1.0977 2.1524 1.7869 1.3986 1.3338 1.2771 1.7392 1.1889 1.1926 1.2211 1.5233 1.4241 1.4160 1.4713 1.4460 5.4977 1.1972 1.4690 2.3308 1.1996 1.1056 1.9668 1.0608 1.2101 1.0618 1.0478 1.0757 1.0746 1.0911 1.0917 1.0824 1.4017 1.7151 6.4047 6.3174 4.2450 1.0713 1.0704 1.0590 1.0367 1.0686 1.0588 1.0964 1.0358 1.0847 1.1026 1.0614 1.1005 1.0923 1.0925 1.1040 1.0998 1.1003 1.0969 1.0877 1.0896 1.0983 1.0951 1.0738 1.0757
irintensity: 0.3404 0.2824 2.0222 1.3871 6.2361 1.6159 0.6303 5.4525 0.6700 1.0107 2.7736 5.1767 4.0052 0.6570 0.7736 0.3674 5.9121 4.4008 9.9466 0.2197 4.2693 2.0943 5.1415 0.5635 12.2331 2.3008 7.9156 8.5490 7.7511 0.0813 4.1211 46.3971 91.0838 13.6510 6.6964 1.7553 64.5016 32.6052 2.5917 4.4306 0.9476 2.2882 2.5935 14.9222 7.1707 5.0159 4.5717 2.9281 0.4267 1.2935 2.9374 16.0106 128.8195 7.7165 1.1454 12.5830 36.4865 7.5439 0.1595 0.3812 77.1946 2.0583 15.3984 0.1970 62.5905 12.5030 6.7032 0.3297 22.6143 11.7491 7.5811 5.8448 13.6703 32.1451 19.0314 29.4827 4.4908 4.0773 67.7139 10.8162 10.1362 174.6034 7.1665 8.8352 31.6668 14.3581 37.9843 8.1044 11.9976 6.5764 7.0751 12.2346 6.6945 5.7363 111.4301 256.6447 85.9050 4.5620 92.3547 110.2854 96.4394 55.9447 102.5984 40.8998 16.1363 68.9735 32.6665 17.9749 71.5571 32.6754 10.4353 48.1108 11.4707 44.8797 57.0469 31.8239 35.4934 11.3354 17.0269 29.5451 10.3547 1.3238 18.8341
temp: 298.150 k
press: 1.00000 atm
elementType: 8 8 7 7 6 6 6 6 6 6 6 6 6 6 6 6 6 6 6 1 1 1 1 1 1 1 1 1 1 1 1 1 1 1 1 1 1 1 1 1 1 1 1
symmnumber: 1
zpe: 966388.3 jmol-1
zpe.correction: 0.368078 hartree
zpe.thermalcorrener: 0.389598 hartree
zpe.thermalcorrenthalpy: 0.390542 hartree
zpe.thermalcorrgfe: 0.313427 hartree
zpe.sumelectzpe: -844.451455 hartree
zpe.sumelectthermal: -844.429935 hartree
zpe.sumelectthermalent: -844.428991 hartree
zpe.sumelectthermalfe: -844.506106 hartree
dipole: -0.2967 2.6336 0.9619
dipole: 2.8194
quadrupole: -102.3043 -112.9471 -119.4794
quadrupole: -15.8984 2.5510 0.0920
quadrupole: 9.2726 -1.3702 -7.9025 -15.8984 2.5510 0.0920
hfenergy: -844.819533 hartree
pointgroup: C01 [X(C15H24N2O2)]
dipole: -0.1088229 0.9412607 0.5767443 debye
polarizability: 270.3245225|8.325813|177.8892572|-15.0345033|16.8182163|126.2033931 unknown
InChI: InChI=1S/C15H24N2O2/c1-3-13-7-4-5-8-14(13)17-15(18)9-6-10-16-11-12-19-2/h4-5,7-8,16-17H,3,6,9-12H2,1-2H3
charge 0 multiplicity 1
43 atoms
O  7.888822 0.367453 0.0195
O  -0.763361 -1.476875 -1.258174
N  4.213601 -0.21225 -0.17395
N  -1.912347 0.2678 -0.173418
C  1.736463 -0.22701 -0.328991
C  3.02828 0.575816 -0.570475
C  0.470795 0.570431 -0.717837
C  5.508356 0.480909 -0.348079
C  -0.780398 -0.319983 -0.740758
C  -3.239866 -0.24611 -0.059459
C  -4.230824 0.588352 0.551966
C  -3.921029 2.00433 1.028652
C  6.634691 -0.342084 0.287078
C  -3.580859 -1.544287 -0.52433
C  -5.545123 0.0812 0.677573
C  -3.873561 3.042615 -0.12798
C  -4.903576 -2.01416 -0.38696
C  -5.893983 -1.20712 0.214735
C  9.040779 -0.303107 0.614521
H  1.74768 -1.15874 -0.927193
H  1.69208 -0.527367 0.734408
H  3.059284 0.90239 -1.64305
H  3.017609 1.501487 0.040199
H  0.60372 0.975593 -1.742421
H  0.339713 1.439883 -0.043219
H  4.213083 -1.134527 -0.633618
H  5.771858 0.686337 -1.413499
H  5.452638 1.459618 0.164113
H  -1.768315 1.20014 0.21746
H  -2.970302 2.040108 1.602471
H  -4.701979 2.315563 1.746039
H  6.67234 -1.365637 -0.155603
H  6.461122 -0.445497 1.379746
H  -2.806174 -2.160397 -0.983938
H  -6.307268 0.713705 1.149607
H  -3.640824 4.052612 0.256517
H  -4.849389 3.086428 -0.642764
H  -3.115633 2.781489 -0.889393
H  -5.154528 -3.016722 -0.750706
H  -6.919914 -1.573853 0.326468
H  8.948961 -0.370282 1.720228
H  9.172566 -1.328999 0.206973
H  9.921913 0.306247 0.358363
