program: Gaussian 16
title: Title Card Required
version: ES64L-G16RevC.02
basis: 6-31+G(d,p)
method: UwB97XD TD-FC
operation: Force
keyword: #p
keyword: td=(nstates=30,root=3)
keyword: uwb97xd/6-31+g(d,p)
keyword: force
keyword: scrf=(CPCM,solvent=chloroform)
keyword: nosymm
keyword: scf=xqc
keyword: Guess=mix
keyword: density=current
title: #p td=(nstates=30,root=3) uwb97xd/6-31+g(d,p) force scrf=(CPCM,solvent
basis: NPDir=0 NMtPBC= 1 NCelOv= 1 NCel= 1 NClECP= 1 NCelD= 1
basis: NCelK= 1 NCelE2= 1 NClLst= 1 CellRange= 0.0.
basis: One-electron integrals computed using PRISM.
basis: NBasis= 859 RedAO= T EigKep= 1.06D-06 NBF= 859
basis: NBsUse= 853 1.00D-06 EigRej= 9.75D-07 NBFU= 853
converged: NO NO NO NO
hfenergy: -1479.2139347 hartree
pointgroup: C01 [X(C32H35N3O1)]
dipole: -3.2936465 -0.2307105 -3.3705664 debye
InChI: InChI=1/32C.3N.O.35H
charge 2 multiplicity 1
71 atoms
C  0.26326044 -1.93874033 -0.00727429
C  -0.92618378 -1.78413517 -0.7748176
C  -1.3808997 -0.46272195 -1.12608305
C  -0.60131697 0.62900398 -0.75310649
C  0.56977472 0.44463309 -0.01946496
C  1.02815834 -0.86231865 0.37858207
C  -0.59945978 -3.98667023 -0.36873556
C  -1.46326425 -3.07393466 -1.00583161
H  -2.31586293 -0.31103807 -1.65214813
H  -0.921817 1.63142839 -1.01360987
H  1.1563513 1.3042105 0.28283584
H  1.9302693 -0.97768735 0.95931214
N  0.42960161 -3.3236844 0.23002897
H  -0.6953185 -5.05836213 -0.32195266
C  1.54793823 -3.90918466 0.88116414
O  2.38238386 -3.18233877 1.37566293
C  1.67822177 -5.4102081 0.85910002
H  2.27569792 -5.66204793 1.73703177
H  0.7165986 -5.91902012 0.95951747
C  2.42753473 -5.88792613 -0.41274169
H  2.74200458 -6.91904486 -0.22331641
H  3.3363543 -5.29010744 -0.5350724
C  1.5971039 -5.84550419 -1.66462034
H  0.79946461 -6.58571013 -1.73438888
C  1.77268775 -4.98357659 -2.66752594
H  2.56033969 -4.23381887 -2.64012176
H  1.13920555 -5.00647016 -3.54897296
C  -2.68127986 -3.41527969 -1.67939268
H  -3.28535075 -4.2555239 -1.35408016
N  -3.09952572 -2.72504667 -2.74450806
H  -2.4956285 -2.00638248 -3.12731924
C  -2.61458543 -0.41189662 -4.98843596
C  -3.92220843 -0.69988613 -4.58222323
C  -4.70778329 0.32334499 -4.03965906
C  -4.18699213 1.60498092 -3.89394162
C  -2.87429079 1.8782077 -4.27714501
C  -2.08849875 0.86865888 -4.82626922
H  -2.0023936 -1.18796883 -5.44126089
H  -5.72883498 0.13637164 -3.72243134
H  -4.80822779 2.39026647 -3.47699537
H  -2.47091724 2.87804591 -4.15798212
H  -1.07139697 1.07554845 -5.14044434
C  -4.4049517 -2.13086363 -4.69448603
H  -3.72379531 -2.67760138 -5.35301298
C  -4.42525919 -2.88110011 -3.32200439
H  -4.56597777 -3.9481387 -3.52995222
C  -5.52933698 -2.44827899 -2.36611522
C  -6.74057808 -3.14539515 -2.36279111
C  -5.36015047 -1.37977276 -1.48021823
C  -7.7821988 -2.75427345 -1.52237069
H  -6.86767892 -4.02175172 -2.99242281
C  -6.39324949 -0.99578997 -0.63306034
H  -4.41927932 -0.84299645 -1.44705099
C  -7.61009509 -1.6757293 -0.65819673
H  -8.71604132 -3.30471069 -1.53179028
H  -6.24593259 -0.16594723 0.05048412
H  -8.41437825 -1.37658901 0.00533293
C  -5.89204304 -1.35145774 -6.59435663
C  -6.12919874 -3.6536612 -5.79689171
C  -6.84942718 -2.11762319 -7.48848252
H  -4.90056639 -1.27176307 -7.04361278
H  -6.22750229 -0.36322577 -6.28689863
C  -6.39193952 -3.56234468 -7.29699118
H  -7.02616281 -3.931972 -5.24489087
H  -5.31998547 -4.33285897 -5.53448394
H  -7.88339179 -1.98331534 -7.15619145
H  -6.77441855 -1.77739846 -8.52187599
H  -7.13683724 -4.29698809 -7.60439039
H  -5.47269515 -3.75031386 -7.85852956
N  -5.75223711 -2.23318985 -5.35930387
H  -6.4554755 -1.92968493 -4.678648
