program: Gaussian 16
title: Title Card Required
version: ES64L-G16RevC.02
basis: 6-31+G(d,p)
method: UwB97XD TD-FC
operation: Force
keyword: #p
keyword: td=(nstates=30,root=3)
keyword: uwb97xd/6-31+g(d,p)
keyword: force
keyword: scrf=(CPCM,solvent=chloroform)
keyword: nosymm
keyword: scf=xqc
keyword: Guess=mix
keyword: density=current
title: #p td=(nstates=30,root=3) uwb97xd/6-31+g(d,p) force scrf=(CPCM,solvent
basis: NPDir=0 NMtPBC= 1 NCelOv= 1 NCel= 1 NClECP= 1 NCelD= 1
basis: NCelK= 1 NCelE2= 1 NClLst= 1 CellRange= 0.0.
basis: One-electron integrals computed using PRISM.
basis: NBasis= 859 RedAO= T EigKep= 1.04D-06 NBF= 859
basis: NBsUse= 853 1.00D-06 EigRej= 9.84D-07 NBFU= 853
converged: NO NO NO NO
hfenergy: -1479.2135228 hartree
pointgroup: C01 [X(C32H35N3O1)]
dipole: -3.2995294 -0.199061 -3.3499413 debye
InChI: InChI=1/32C.3N.O.35H
charge 2 multiplicity 1
71 atoms
C  0.26601239 -1.93411975 -0.03339272
C  -0.93303197 -1.78118506 -0.78130226
C  -1.3784543 -0.46239362 -1.15213351
C  -0.57761172 0.63017977 -0.81825749
C  0.60262423 0.45038266 -0.10244751
C  1.05072478 -0.85777673 0.30881921
C  -0.61868988 -3.98165133 -0.35073753
C  -1.48486933 -3.06816166 -0.9831811
H  -2.32668721 -0.3148586 -1.65675305
H  -0.88825497 1.62921868 -1.09998926
H  1.20769823 1.30895302 0.17167725
H  1.96850781 -0.97647917 0.86345552
N  0.42356636 -3.31748139 0.22277888
H  -0.72816215 -5.05174133 -0.28475447
C  1.54348941 -3.90241963 0.87439537
O  2.37899684 -3.17373307 1.36212339
C  1.67213408 -5.40471477 0.86189823
H  2.26245211 -5.65352174 1.74482595
H  0.71165311 -5.91407267 0.95677817
C  2.42954186 -5.89183305 -0.40121649
H  2.72808333 -6.9266161 -0.21032238
H  3.34752268 -5.30728223 -0.51170658
C  1.61390811 -5.82899155 -1.66242463
H  0.79249454 -6.54420479 -1.736724
C  1.83200105 -4.97855545 -2.66450291
H  2.64554788 -4.25614173 -2.63145878
H  1.20769083 -4.97816813 -3.55320949
C  -2.71900704 -3.39667611 -1.63211486
H  -3.34892767 -4.20393627 -1.27385158
N  -3.12010841 -2.72867703 -2.71537885
H  -2.51755062 -2.00714284 -3.09753784
C  -2.60751567 -0.42541412 -4.97091893
C  -3.91586738 -0.70746976 -4.5631525
C  -4.69585411 0.31834347 -4.01671959
C  -4.16612227 1.59516632 -3.86310805
C  -2.8502163 1.86055963 -4.2417294
C  -2.07246302 0.85067895 -4.80127531
H  -2.00090499 -1.20322045 -5.4280735
H  -5.71932348 0.13772279 -3.70332281
H  -4.78362358 2.38377586 -3.44673695
H  -2.43874904 2.85583773 -4.11295948
H  -1.05595953 1.05325431 -5.11971197
C  -4.40563278 -2.13614954 -4.6783348
H  -3.7236708 -2.68417246 -5.33562561
C  -4.43757543 -2.88898565 -3.30729867
H  -4.56694491 -3.95667005 -3.51999139
C  -5.55301506 -2.46705533 -2.36151593
C  -6.76469951 -3.16541133 -2.37832252
C  -5.39484679 -1.40634527 -1.4671132
C  -7.81859155 -2.77495315 -1.55260394
H  -6.88095039 -4.04202532 -3.00860677
C  -6.43989619 -1.02347628 -0.63454811
H  -4.45045474 -0.87592344 -1.41262708
C  -7.6586279 -1.69864693 -0.68363612
H  -8.75306634 -3.32420747 -1.57701975
H  -6.29860585 -0.19853534 0.05552246
H  -8.47418828 -1.39384195 -0.03685718
C  -5.88164106 -1.33594423 -6.5754854
C  -6.12744921 -3.64621813 -5.80391235
C  -6.83918124 -2.08850687 -7.48044356
H  -4.88834405 -1.25710004 -7.02038142
H  -6.21253421 -0.34931981 -6.25813258
C  -6.38613047 -3.53659284 -7.30382699
H  -7.02526427 -3.93036973 -5.25643615
H  -5.31967042 -4.32957526 -5.54774817
H  -7.87272281 -1.9540263 -7.14697465
H  -6.76026453 -1.737048 -8.50996065
H  -7.13221623 -4.26572081 -7.62152633
H  -5.46557421 -3.72100774 -7.86543236
N  -5.74962926 -2.23078283 -5.34972305
H  -6.45517647 -1.93309118 -4.66892407
