program: Gaussian 16
title: Title Card Required
version: ES64L-G16RevC.02
basis: 6-31+G(d,p)
method: UwB97XD TD-FC
operation: Force
keyword: #p
keyword: td=(nstates=30,root=3)
keyword: uwb97xd/6-31+g(d,p)
keyword: force
keyword: scrf=(CPCM,solvent=chloroform)
keyword: nosymm
keyword: scf=xqc
keyword: Guess=mix
keyword: density=current
title: #p td=(nstates=30,root=3) uwb97xd/6-31+g(d,p) force scrf=(CPCM,solvent
basis: NPDir=0 NMtPBC= 1 NCelOv= 1 NCel= 1 NClECP= 1 NCelD= 1
basis: NCelK= 1 NCelE2= 1 NClLst= 1 CellRange= 0.0.
basis: One-electron integrals computed using PRISM.
basis: NBasis= 859 RedAO= T EigKep= 1.05D-06 NBF= 859
basis: NBsUse= 853 1.00D-06 EigRej= 9.78D-07 NBFU= 853
converged: NO NO NO NO
hfenergy: -1479.2139071 hartree
pointgroup: C01 [X(C32H35N3O1)]
dipole: -5.025301 -1.8172349 -4.248465 debye
InChI: InChI=1/32C.3N.O.35H
charge 2 multiplicity 1
71 atoms
C  0.26510289 -1.93734074 -0.0163433
C  -0.92888288 -1.78291217 -0.77704215
C  -1.38098529 -0.46368264 -1.13628566
C  -0.59553705 0.62936846 -0.7759225
C  0.57880682 0.4465268 -0.04615226
C  1.03577319 -0.85975356 0.35666936
C  -0.60680131 -3.98563941 -0.36430224
C  -1.47189851 -3.07171932 -0.99709768
H  -2.31858499 -0.31396658 -1.66060435
H  -0.91480038 1.62996812 -1.04273078
H  1.16933858 1.30735974 0.24856499
H  1.94509153 -0.97505641 0.92767734
N  0.42717653 -3.32288826 0.22652692
H  -0.7061626 -5.05805489 -0.31470488
C  1.54509685 -3.90905322 0.87957177
O  2.3800164 -3.18123594 1.3711161
C  1.67609633 -5.41138938 0.86094482
H  2.27373522 -5.6618075 1.73895821
H  0.71655528 -5.92402732 0.96222666
C  2.42878698 -5.88997368 -0.40909845
H  2.74063458 -6.92215874 -0.2215977
H  3.33980705 -5.29476403 -0.52725547
C  1.60243552 -5.84121808 -1.66317666
H  0.79617331 -6.57199903 -1.73440158
C  1.79142218 -4.98175127 -2.66604778
H  2.58794664 -4.24188067 -2.63611081
H  1.16134559 -4.99716743 -3.5498498
C  -2.69793511 -3.40400161 -1.66218338
H  -3.31305395 -4.23269477 -1.32869948
N  -3.10735227 -2.71765422 -2.73217149
H  -2.50652828 -1.99267629 -3.10874268
C  -2.61286789 -0.41521461 -4.98575073
C  -3.9204564 -0.7018352 -4.57804767
C  -4.70451834 0.32244708 -4.03517361
C  -4.18062133 1.60255114 -3.88596818
C  -2.86620016 1.87285382 -4.26592793
C  -2.08357749 0.86366057 -4.82000698
H  -2.00311736 -1.19123811 -5.44187202
H  -5.72733782 0.13784042 -3.72232128
H  -4.80075578 2.38865657 -3.46897453
H  -2.4591453 2.87042681 -4.13984097
H  -1.06616119 1.06930706 -5.13456639
C  -4.40501017 -2.13261474 -4.68974203
H  -3.72332715 -2.68003236 -5.34718859
C  -4.42803905 -2.88282853 -3.3177273
H  -4.55787302 -3.95159596 -3.52642977
C  -5.53749609 -2.4563521 -2.36545593
C  -6.7490782 -3.15306585 -2.36777898
C  -5.36881202 -1.392546 -1.47401638
C  -7.79266816 -2.76244592 -1.52981402
H  -6.87474129 -4.02803179 -2.9999805
C  -6.40666558 -1.0044631 -0.63407696
H  -4.42387543 -0.86371596 -1.42948209
C  -7.62516024 -1.68153816 -0.66792345
H  -8.72544063 -3.31556253 -1.53980385
H  -6.26155862 -0.17447347 0.04955971
H  -8.43418882 -1.37827658 -0.01202719
C  -5.8878285 -1.34720846 -6.58654168
C  -6.12830336 -3.65234039 -5.79876967
C  -6.84518262 -2.10788159 -7.48462181
H  -4.89537847 -1.2685557 -7.03396281
H  -6.22093693 -0.35940073 -6.27538818
C  -6.3900974 -3.55411361 -7.29870471
H  -7.02610532 -3.93233449 -5.24919649
H  -5.31991952 -4.33338346 -5.53797681
H  -7.87908123 -1.97332428 -7.15267233
H  -6.76815419 -1.76279649 -8.51616135
H  -7.13595347 -4.28620832 -7.60994422
H  -5.47084301 -3.7409945 -7.86055951
N  -5.75132274 -2.23355892 -5.35521661
H  -6.45488856 -1.93283761 -4.67352133
