program: Gaussian 16
title: Title Card Required
version: ES64L-G16RevC.02
basis: 6-31+G(d,p)
method: UwB97XD TD-FC
operation: Force
keyword: #p
keyword: td=(nstates=30,root=3)
keyword: uwb97xd/6-31+g(d,p)
keyword: force
keyword: scrf=(CPCM,solvent=chloroform)
keyword: nosymm
keyword: scf=xqc
keyword: Guess=mix
keyword: density=current
title: #p td=(nstates=30,root=3) uwb97xd/6-31+g(d,p) force scrf=(CPCM,solvent
basis: NPDir=0 NMtPBC= 1 NCelOv= 1 NCel= 1 NClECP= 1 NCelD= 1
basis: NCelK= 1 NCelE2= 1 NClLst= 1 CellRange= 0.0.
basis: One-electron integrals computed using PRISM.
basis: NBasis= 859 RedAO= T EigKep= 1.05D-06 NBF= 859
basis: NBsUse= 853 1.00D-06 EigRej= 9.76D-07 NBFU= 853
converged: NO NO NO NO
hfenergy: -1479.2139604 hartree
pointgroup: C01 [X(C32H35N3O1)]
dipole: -5.0226337 -1.8169361 -4.2564814 debye
InChI: InChI=1/32C.3N.O.35H
charge 2 multiplicity 1
71 atoms
C  0.26570031 -1.939105 -0.01248789
C  -0.92802275 -1.78300638 -0.77447379
C  -1.38094553 -0.46350859 -1.13260996
C  -0.59941175 0.62849881 -0.76693771
C  0.57337143 0.4434566 -0.0361273
C  1.03320609 -0.86219101 0.36389794
C  -0.60460294 -3.98487283 -0.36588828
C  -1.46976304 -3.0711463 -0.99874049
H  -2.31541505 -0.31090711 -1.65963197
H  -0.91941418 1.62980244 -1.0308301
H  1.15977438 1.30390452 0.26246522
H  1.93874049 -0.97365246 0.94151249
N  0.42920632 -3.32425984 0.22707147
H  -0.70142287 -5.05692056 -0.32008488
C  1.54608151 -3.91125629 0.87962493
O  2.38091001 -3.18449152 1.37357799
C  1.67753903 -5.4126942 0.86081404
H  2.27613871 -5.66112382 1.73849755
H  0.71733707 -5.92348725 0.96159244
C  2.42857797 -5.88951904 -0.41067947
H  2.74142206 -6.92097287 -0.22284992
H  3.33756727 -5.29167867 -0.530178
C  1.60007181 -5.84223895 -1.66387413
H  0.79747659 -6.57772904 -1.73401632
C  1.78341604 -4.98280053 -2.666179
H  2.57671482 -4.23874287 -2.6370322
H  1.151791 -5.00132608 -3.54942176
C  -2.69094741 -3.40669541 -1.6688686
H  -3.3039049 -4.23896581 -1.34000218
N  -3.10404777 -2.71807813 -2.73622109
H  -2.5035353 -1.99312251 -3.11333203
C  -2.61391239 -0.41344618 -4.98811269
C  -3.92115328 -0.70083077 -4.5808345
C  -4.70615749 0.32310475 -4.03830458
C  -4.18344375 1.60358392 -3.89003843
C  -2.86942283 1.8751406 -4.27053793
C  -2.08583253 0.86612767 -4.82313307
H  -2.00331558 -1.18919861 -5.44352537
H  -5.72855931 0.13778879 -3.72477403
H  -4.80380098 2.3894114 -3.47304618
H  -2.46356574 2.87343565 -4.14625573
H  -1.06856369 1.07224359 -5.1371474
C  -4.40470986 -2.13189809 -4.69158442
H  -3.7232069 -2.67933423 -5.34949238
C  -4.4260181 -2.88074078 -3.31909271
H  -4.55848419 -3.9493516 -3.52768868
C  -5.53382483 -2.45366632 -2.36543014
C  -6.74598075 -3.15046878 -2.36601225
C  -5.36452506 -1.38927861 -1.47610693
C  -7.78770171 -2.75949316 -1.52603436
H  -6.87329543 -4.02512519 -2.99780999
C  -6.40082245 -1.00088084 -0.63431082
H  -4.4199193 -0.85935032 -1.43430013
C  -7.61885465 -1.67881156 -0.66453313
H  -8.72055444 -3.31265971 -1.53306476
H  -6.25440713 -0.17071003 0.04836936
H  -8.42582305 -1.37585163 -0.00620747
C  -5.88934017 -1.34934481 -6.5890519
C  -6.12871384 -3.65330414 -5.79782848
C  -6.8467831 -2.11184659 -7.48578154
H  -4.89727042 -1.27057001 -7.03697241
H  -6.22295678 -0.3612737 -6.27948963
C  -6.39074382 -3.55748388 -7.29789001
H  -7.02626382 -3.93255924 -5.24750917
H  -5.32006068 -4.33351223 -5.53605737
H  -7.88075854 -1.97711708 -7.15389215
H  -6.77008946 -1.76824138 -8.51788973
H  -7.13657871 -4.29027535 -7.60751437
H  -5.47145548 -3.74515623 -7.85988026
N  -5.75154459 -2.23392345 -5.35646053
H  -6.45506454 -1.93257127 -4.67520079
